ACCESSION: MSBNK-Nihon_Univ-NU000745
RECORD_TITLE: N-(3a-Hydroxy-5b-cholan-24-oyl)-glycine; LC-ESI-TOF; MS; NEGATIVE; In source decay -150 V
DATE: 2018.02.20
AUTHORS: Takashi Iida, Department of Chemistry, College of Humanities and Sciences, Nihon University
LICENSE: CC BY
COPYRIGHT: Takashi Iida, Department of Chemistry, College of Humanities and Sciences, Nihon University
COMMENT: BA-129-150. In-source decay
COMMENT: 1 microL of the bile acid in MeOH solution was flow injected. Sampling interval was 1 Hz.
COMMENT: This record was created by the financial support of MEXT/JSPS KAKENHI Grant Number 17HP8021 (2017) to the MassBank database committee of the Mass Spectrometry Society of Japan.

CH$NAME: N-(3a-Hydroxy-5b-cholan-24-oyl)-glycine
CH$NAME: Glycolithocholic acid
CH$COMPOUND_CLASS: Natural Product; Bile acids
CH$FORMULA: C26H43NO4
CH$EXACT_MASS: 433.31921
CH$SMILES: CC(CCC(=O)NCC(=O)O)C1CCC2C1(CCC3C2CCC4C3(CCC(C4)O)C)C
CH$IUPAC: InChI=1S/C26H43NO4/c1-16(4-9-23(29)27-15-24(30)31)20-7-8-21-19-6-5-17-14-18(28)10-12-25(17,2)22(19)11-13-26(20,21)3/h16-22,28H,4-15H2,1-3H3,(H,27,29)(H,30,31)/t16-,17-,18-,19+,20-,21+,22+,25+,26-/m1/s1
CH$LINK: CHEMSPIDER 103116
CH$LINK: INCHIKEY XBSQTYHEGZTYJE-OETIFKLTSA-N
CH$LINK: PUBCHEM CID:115245
CH$LINK: COMPTOX DTXSID00963828

AC$INSTRUMENT: JMS-T100LP, JEOL
AC$INSTRUMENT_TYPE: LC-ESI-TOF
AC$MASS_SPECTROMETRY: MS_TYPE MS
AC$MASS_SPECTROMETRY: ION_MODE NEGATIVE
AC$MASS_SPECTROMETRY: IONIZATION ESI
AC$MASS_SPECTROMETRY: ORIFICE_TEMPERATURE 80 C
AC$MASS_SPECTROMETRY: ORIFICE_VOLTAGE -150 V
AC$MASS_SPECTROMETRY: SCAN_RANGE_M/Z 100-1000

PK$SPLASH: splash10-00e9-9001500020-ce57d0bd5c5d58d3ef12
PK$NUM_PEAK: 16
PK$PEAK: m/z int. rel.int.
  72.04 2 25
  74.02 100 999
  75.02 3 31
  84.04 6 64
  386.29 4 38
  388.31 12 122
  389.31 4 43
  432.30 42 416
  433.29 14 138
  434.30 3 26
  468.29 3 27
  865.60 18 178
  866.63 10 98
  867.62 3 35
  887.61 3 31
  888.61 2 21