ACCESSION: MSBNK-Osaka_Univ-OUF00056
RECORD_TITLE: 3-Hydroxypyruvic acid; GC-EI-TOF; MS; n TMS; RT:431.597 sec
DATE: 2016.01.19 (Created 2010.05.20, modified 2013.04.24)
AUTHORS: Tsujimoto Y, Tsugawa H, Bamba T, Fukusaki E, engineering department, Osaka Univ.
LICENSE: CC BY-SA
COMMENT: The chemical compound was chemically modified with N-methyl-N-trimethylsilyl-trifluoroacetamide (MSTFA) before GC-MS analysis. When it has two or more functional groups, this modification gave a mixture of the TMS derivatives having different number of TMS groups at different functional groups.

CH$NAME: 3-Hydroxypyruvate
CH$NAME: 3-Hydroxypyruvic acid
CH$COMPOUND_CLASS: Natural Product
CH$FORMULA: C3H4O4
CH$EXACT_MASS: 104.01096
CH$SMILES: OCC(=O)C(O)=O
CH$IUPAC: InChI=1S/C3H4O4/c4-1-2(5)3(6)7/h4H,1H2,(H,6,7)
CH$LINK: CAS 1113-60-6
CH$LINK: CHEBI 17180 30841
CH$LINK: CHEMSPIDER 939
CH$LINK: KEGG C00168
CH$LINK: PUBCHEM CID:964
CH$LINK: INCHIKEY HHDDCCUIIUWNGJ-UHFFFAOYSA-N
CH$LINK: COMPTOX DTXSID40149588

AC$INSTRUMENT: Pegasus III TOF-MS system, Leco; GC 6890, Agilent Technologies
AC$INSTRUMENT_TYPE: GC-EI-TOF
AC$MASS_SPECTROMETRY: MS_TYPE MS
AC$MASS_SPECTROMETRY: ION_MODE POSITIVE
AC$MASS_SPECTROMETRY: HELIUM_FLOW 1 ml/min
AC$MASS_SPECTROMETRY: ION_SOURCE_TEMPERATURE 200 C
AC$MASS_SPECTROMETRY: SCAN_RANGE_M/Z 85-500
AC$CHROMATOGRAPHY: COLUMN_NAME CP-SIL 8 CB LOW BLEED/MS
AC$CHROMATOGRAPHY: INJECTION_TEMPERATURE 230 C
AC$CHROMATOGRAPHY: OVEN_TEMPERATURE 80 C (Duration 2 min)-330 C (rate: 15 C/min; Duration 6 min)
AC$CHROMATOGRAPHY: RETENTION_INDEX 1277.544
AC$CHROMATOGRAPHY: RETENTION_TIME 431.597 sec
AC$CHROMATOGRAPHY: TRANSFARLINE_TEMPERATURE 250 C

MS$DATA_PROCESSING: WHOLE ChromaTOF ver. 2.32 (LECO)

PK$SPLASH: splash10-0gvt-2900000000-37fc3d3c38147e1d8cd8
PK$NUM_PEAK: 85
PK$PEAK: m/z int. rel.int.
  85 138 138
  86 81 81
  87 29 29
  88 46 46
  89 570 570
  90 49 49
  91 22 22
  94 1 1
  98 22 22
  99 10 10
  100 494 494
  101 52 52
  102 148 148
  103 413 413
  104 45 45
  105 19 19
  106 1 1
  110 5 5
  114 714 714
  115 95 95
  116 38 38
  117 41 41
  118 1 1
  119 11 11
  128 251 251
  129 27 27
  130 47 47
  131 100 100
  132 11 11
  133 111 111
  134 14 14
  137 2 2
  138 1 1
  141 1 1
  142 9 9
  143 3 3
  144 1 1
  146 6 6
  147 999 999
  148 182 182
  149 81 81
  156 13 13
  157 2 2
  158 20 20
  159 6 6
  160 65 65
  161 1 1
  162 2 2
  163 68 68
  164 9 9
  172 37 37
  177 83 83
  178 5 5
  186 25 25
  187 4 4
  188 11 11
  189 5 5
  191 7 7
  199 5 5
  201 14 14
  202 5 5
  204 41 41
  205 2 2
  216 8 8
  230 2 2
  234 15 15
  235 5 5
  237 3 3
  246 25 25
  247 2 2
  258 4 4
  262 264 264
  263 53 53
  264 11 11
  280 3 3
  287 2 2
  316 1 1
  321 1 1
  332 3 3
  340 2 2
  353 1 1
  378 4 4
  389 1 1
  391 3 3
  415 4 4