ACCESSION: MSBNK-RIKEN-PR010176
RECORD_TITLE: Malonic acid; GC-EI-TOF; MS; 2 TMS; BP:147
DATE: 2016.01.19 (Created 2006.12.21, modified 2011.05.06)
AUTHORS: Kusano M, Fukushima A, Plant Science Center, RIKEN.
LICENSE: CC BY-SA

CH$NAME: Malonic acid
CH$NAME: Malonate
CH$NAME: Propanedioic acid
CH$COMPOUND_CLASS: Natural Product
CH$FORMULA: C3H4O4
CH$EXACT_MASS: 104.01096
CH$SMILES: OC(=O)CC(O)=O
CH$IUPAC: InChI=1S/C3H4O4/c4-2(5)1-3(6)7/h1H2,(H,4,5)(H,6,7)
CH$LINK: CAS 141-82-2
CH$LINK: CHEBI 30794
CH$LINK: CHEMPDB MLA
CH$LINK: KEGG C00383
CH$LINK: NIKKAJI J2.541K
CH$LINK: PUBCHEM 3673
CH$LINK: INCHIKEY OFOBLEOULBTSOW-UHFFFAOYSA-N
CH$LINK: COMPTOX DTXSID7021659

AC$INSTRUMENT: Pegasus III TOF-MS system, Leco; GC 6890, Agilent Technologies
AC$INSTRUMENT_TYPE: GC-EI-TOF
AC$MASS_SPECTROMETRY: MS_TYPE MS
AC$MASS_SPECTROMETRY: ION_MODE POSITIVE
AC$CHROMATOGRAPHY: RETENTION_INDEX 1193.9
AC$CHROMATOGRAPHY: RETENTION_TIME 314.251 sec

MS$FOCUSED_ION: BASE_PEAK 147
MS$FOCUSED_ION: DERIVATIVE_FORM C9H20O4Si2
MS$FOCUSED_ION: DERIVATIVE_MASS 248.09001
MS$FOCUSED_ION: DERIVATIVE_TYPE 2 TMS
MS$DATA_PROCESSING: WHOLE ChromaTOF ver. 2.32 (Leco)

PK$SPLASH: splash10-006t-9700000000-54976b3ce8f36ce0676d
PK$NUM_PEAK: 72
PK$PEAK: m/z int. rel.int.
  60 24 24
  61 60 60
  62 5 5
  63 4 4
  65 1 1
  66 161 161
  67 14 14
  69 19 19
  70 13 13
  71 13 13
  72 76 76
  73 796 796
  74 87 87
  75 318 318
  76 32 32
  77 49 49
  78 5 5
  79 9 9
  83 1 1
  84 2 2
  85 4 4
  86 1 1
  87 18 18
  88 10 10
  89 6 6
  90 1 1
  91 1 1
  92 1 1
  93 2 2
  98 1 1
  99 58 58
  100 6 6
  101 25 25
  102 7 7
  103 13 13
  104 2 2
  105 7 7
  109 12 12
  110 1 1
  113 2 2
  115 16 16
  116 9 9
  117 20 20
  118 3 3
  119 4 4
  131 33 33
  132 5 5
  133 46 46
  134 6 6
  135 4 4
  143 25 25
  144 2 2
  145 1 1
  146 2 2
  147 999 999
  148 162 162
  149 88 88
  150 9 9
  151 2 2
  159 1 1
  162 1 1
  173 2 2
  189 5 5
  190 1 1
  191 1 1
  204 1 1
  217 4 4
  233 47 47
  234 9 9
  235 4 4
  248 6 6
  249 1 1