ACCESSION: MSBNK-RIKEN-PR301794
RECORD_TITLE: (+)-Chelidonine; LC-ESI-QTOF; MS2
DATE: 2019.03.28
AUTHORS: Tetsuya Mori, Center for Sustainable Resource Science, RIKEN
LICENSE: CC BY-NC-SA
PUBLICATION: Tsugawa H., Nakabayashi R., Mori T., Yamada Y., Takahashi M., Rai A., Sugiyama R., Yamamoto H., Nakaya T., Yamazaki M., Kooke R., Bac-Molenaar JA., Oztolan-Erol N., Keurentjes JJB., Arita M., Saito K. (2019) "A cheminformatics approach to characterize metabolomes in stable-isotope-labeled organisms" Nature Methods 16(4):295-298. [doi:10.1038/s41592-019-0358-2]
COMMENT: registered in RIKEN PlaSMA

CH$NAME: Chelidonin
CH$NAME: (+)-Chelidonine
CH$NAME: [1,3]Benzodioxolo[5,6-c]-1,3-dioxolo[4,5-i]phenanthridin-6-ol, 5b,6,7,12b,13,14-hexahydro-13-methyl-, (5bR,6S,12bS)-
CH$COMPOUND_CLASS: Hexahydrobenzophenanthridine alkaloids
CH$FORMULA: C20H19NO5
CH$EXACT_MASS: 353.126323
CH$SMILES: CN1CC2=C(C=CC3=C2OCO3)[C@@H]4[C@H]1C5=CC6=C(C=C5C[C@@H]4O)OCO6
CH$IUPAC: InChI=1S/C20H19NO5/c1-21-7-13-11(2-3-15-20(13)26-9-23-15)18-14(22)4-10-5-16-17(25-8-24-16)6-12(10)19(18)21/h2-3,5-6,14,18-19,22H,4,7-9H2,1H3/t14-,18-,19+/m0/s1
CH$LINK: CAS 476-32-4
CH$LINK: CHEMSPIDER 171216
CH$LINK: COMPTOX DTXSID10878474
CH$LINK: INCHIKEY GHKISGDRQRSCII-ZOCIIQOWSA-N
CH$LINK: PUBCHEM CID:197810

AC$INSTRUMENT: LC, Waters Acquity UPLC System; MS, Waters Xevo G2 Q-Tof
AC$INSTRUMENT_TYPE: LC-ESI-QTOF
AC$MASS_SPECTROMETRY: MS_TYPE MS2
AC$MASS_SPECTROMETRY: ION_MODE POSITIVE
AC$MASS_SPECTROMETRY: COLLISION_ENERGY 6V
AC$MASS_SPECTROMETRY: DESOLVATION_GAS_FLOW 800/h
AC$MASS_SPECTROMETRY: DESOLVATION_TEMPERATURE 450 C
AC$MASS_SPECTROMETRY: IONIZATION ESI
AC$CHROMATOGRAPHY: CAPILLARY_VOLTAGE +3.00 kV
AC$CHROMATOGRAPHY: COLUMN_NAME Acquity bridged ethyl hybrid C18 (1.7 um, 2.1 mm * 100 mm, Waters)
AC$CHROMATOGRAPHY: COLUMN_TEMPERATURE 40 C
AC$CHROMATOGRAPHY: FLOW_GRADIENT A/B = (99.5%/0.5% at 0 min, 99.5%/0.5% at 0.1 min, 20%/80% at 10 min, 0.5%/99.5% at 10.1 min, 0.5%/99.5% at 12.0 min, 99.5%/0.5% at 12.1 min, 99.5%/0.5% at 15.0 min)
AC$CHROMATOGRAPHY: FLOW_RATE 0.3 ml/min at 0 min, 0.3 ml/min at 10 min, 0.4 ml/min at 10.1 min, 0.4 ml/min at 14.4 min, 0.3 ml/min at 14.5 min
AC$CHROMATOGRAPHY: RETENTION_TIME 4.5206
AC$CHROMATOGRAPHY: SOLVENT A water including 0.1% formic acid
AC$CHROMATOGRAPHY: SOLVENT B acetonitrile including 0.1% formic acid

MS$FOCUSED_ION: PRECURSOR_TYPE [M+H]+
MS$FOCUSED_ION: PRECURSOR_M/Z 354.1335992

PK$SPLASH: splash10-004j-0190000000-7d40d2100c5d3576f6f8
PK$NUM_PEAK: 53
PK$PEAK: m/z int. rel.int.
  131.05089 6.0 6
  135.04509 81.0 81
  136.04692 12.0 12
  143.05023 8.0 8
  149.06358 11.0 11
  159.04463 17.0 17
  161.06113 32.0 32
  163.03947 82.0 82
  164.04659 7.0 7
  173.06171 14.0 14
  176.07187 23.0 23
  179.08664 8.0 8
  187.0428 5.0 5
  188.07275 50.0 50
  189.07195 83.0 83
  190.07376 11.0 11
  191.0874 5.0 5
  207.08366 15.0 15
  217.06538 104.0 104
  218.07204 23.0 23
  219.08606 8.0 8
  235.0752 42.0 42
  236.08554 7.0 7
  237.09074 50.0 50
  245.06178 46.0 46
  246.06978 7.0 7
  247.02248 6.0 6
  247.04143 5.0 5
  247.0769 560.0 559
  248.08066 127.0 127
  249.0907 10.0 10
  263.07416 18.0 18
  265.08765 70.0 70
  266.091 10.0 10
  275.01831 5.0 5
  275.07147 1000.0 999
  275.11917 7.0 7
  276.07516 235.0 235
  277.06589 8.0 8
  277.08365 25.0 25
  279.07318 5.0 5
  293.07822 16.0 16
  293.09097 9.0 9
  294.08621 7.0 7
  295.09634 41.0 41
  305.07446 18.0 18
  305.0867 22.0 22
  307.09338 7.0 7
  323.08813 17.0 17
  323.09827 15.0 15
  324.09698 5.0 5
  336.11813 14.0 14
  336.13199 5.0 5