ACCESSION: MSBNK-RIKEN-PR301925
RECORD_TITLE: isorhamnetin; LC-ESI-QTOF; MS2
DATE: 2019.03.28
AUTHORS: Tetsuya Mori, Center for Sustainable Resource Science, RIKEN
LICENSE: CC BY-NC-SA
PUBLICATION: Tsugawa H., Nakabayashi R., Mori T., Yamada Y., Takahashi M., Rai A., Sugiyama R., Yamamoto H., Nakaya T., Yamazaki M., Kooke R., Bac-Molenaar JA., Oztolan-Erol N., Keurentjes JJB., Arita M., Saito K. (2019) "A cheminformatics approach to characterize metabolomes in stable-isotope-labeled organisms" Nature Methods 16(4):295-298. [doi:10.1038/s41592-019-0358-2]
COMMENT: registered in RIKEN PlaSMA

CH$NAME: isorhamnetin
CH$COMPOUND_CLASS: Flavonols
CH$FORMULA: C16H12O7
CH$EXACT_MASS: 316.265
CH$SMILES: COC1=C(O)C=CC(=C1)C1=C(O)C(=O)C2=C(O)C=C(O)C=C2O1
CH$IUPAC: InChI=1S/C16H12O7/c1-22-11-4-7(2-3-9(11)18)16-15(21)14(20)13-10(19)5-8(17)6-12(13)23-16/h2-6,17-19,21H,1H3
CH$LINK: INCHIKEY IZQSVPBOUDKVDZ-UHFFFAOYSA-N

AC$INSTRUMENT: LC, Waters Acquity UPLC System; MS, Waters Xevo G2 Q-Tof
AC$INSTRUMENT_TYPE: LC-ESI-QTOF
AC$MASS_SPECTROMETRY: MS_TYPE MS2
AC$MASS_SPECTROMETRY: ION_MODE POSITIVE
AC$MASS_SPECTROMETRY: COLLISION_ENERGY 6V
AC$MASS_SPECTROMETRY: DESOLVATION_GAS_FLOW 800/h
AC$MASS_SPECTROMETRY: DESOLVATION_TEMPERATURE 450 C
AC$MASS_SPECTROMETRY: IONIZATION ESI
AC$CHROMATOGRAPHY: CAPILLARY_VOLTAGE +3.00 kV
AC$CHROMATOGRAPHY: COLUMN_NAME Acquity bridged ethyl hybrid C18 (1.7 um, 2.1 mm * 100 mm, Waters)
AC$CHROMATOGRAPHY: COLUMN_TEMPERATURE 40 C
AC$CHROMATOGRAPHY: FLOW_GRADIENT A/B = (99.5%/0.5% at 0 min, 99.5%/0.5% at 0.1 min, 20%/80% at 10 min, 0.5%/99.5% at 10.1 min, 0.5%/99.5% at 12.0 min, 99.5%/0.5% at 12.1 min, 99.5%/0.5% at 15.0 min)
AC$CHROMATOGRAPHY: FLOW_RATE 0.3 ml/min at 0 min, 0.3 ml/min at 10 min, 0.4 ml/min at 10.1 min, 0.4 ml/min at 14.4 min, 0.3 ml/min at 14.5 min
AC$CHROMATOGRAPHY: RETENTION_TIME 6.135867
AC$CHROMATOGRAPHY: SOLVENT A water including 0.1% formic acid
AC$CHROMATOGRAPHY: SOLVENT B acetonitrile including 0.1% formic acid

MS$FOCUSED_ION: PRECURSOR_TYPE [M+H]+
MS$FOCUSED_ION: PRECURSOR_M/Z 317.0655792

PK$SPLASH: splash10-014i-0139000000-0c97217b9e32c26f4581
PK$NUM_PEAK: 43
PK$PEAK: m/z int. rel.int.
  121.02483 11.0 11
  139.03969 6.0 6
  151.0372 6.0 6
  153.01804 81.0 81
  154.02052 15.0 15
  155.04984 6.0 6
  159.03844 6.0 6
  192.0432 6.0 6
  200.04445 7.0 7
  201.04498 7.0 7
  201.05598 8.0 8
  203.03366 14.0 14
  217.04773 19.0 19
  217.05724 6.0 6
  228.04347 33.0 33
  229.04549 44.0 44
  229.05479 16.0 16
  230.04463 7.0 7
  230.05945 7.0 7
  231.02008 6.0 6
  231.03055 11.0 11
  245.03102 13.0 13
  245.04436 19.0 19
  245.06017 7.0 7
  246.05281 10.0 10
  256.03699 8.0 8
  257.04721 17.0 17
  271.64935 5.0 5
  273.03424 19.0 19
  273.0455 10.0 10
  274.03055 7.0 7
  274.05032 41.0 41
  275.04529 11.0 11
  285.0387 42.0 42
  286.04352 12.0 12
  287.05267 8.0 8
  302.01978 12.0 12
  302.03607 73.0 73
  302.04718 89.0 89
  303.04834 12.0 12
  303.05896 6.0 6
  317.02625 5.0 5
  317.06525 1000.0 999