ACCESSION: MSBNK-RIKEN_ReSpect-PS000206
RECORD_TITLE: 2,5-Dihydroxydioxane-2,5-dimethanol, 1,3-Dihydroxy-2-propanone Dimer, 1,3-Dihydroxyacetone dimer; LC-ESI-QQ; MS2
DATE: 2009.02.09
AUTHORS: Sawada Y, Matsuda F, and Hirai MY. Plant Science Center, RIKEN
LICENSE: CC BY-NC
COPYRIGHT: Copyright(C) 2008 Plant Science Center, RIKEN
PUBLICATION: Sawada, Y.; Akiyama, K.; Sakata, A.; Kuwahara, A.; Otsuki, H.; Sakurai, T.; Saito, K.; Hirai, M. Y. Widely Targeted Metabolomics Based on Large-Scale MS/MS Data for Elucidating Metabolite Accumulation Patterns in Plants. Plant and Cell Physiology 2008, 50 (1), 37–47. DOI:10.1093/pcp/pcn183
COMMENT: Build 5
COMMENT: Data acquisition and generation is financially supported in part by CREST/JST.
COMMENT: Source compound Aldrich, D107204.
COMMENT: PRIMe compound in-house ID 2
COMMENT: This spectra was automatically generated from the raw data without manual curation of data quality.
COMMENT: The spectral data and services are available to the research and academic community only.
COMMENT: All users must cite follwing literature in publication(s).

CH$NAME: 2,5-Dihydroxydioxane-2,5-dimethanol
CH$NAME: 1,3-Dihydroxy-2-propanone Dimer
CH$NAME: 1,3-Dihydroxyacetone dimer
CH$COMPOUND_CLASS: CLASS1 Other CLASS2 Other CLASS3 Other
CH$FORMULA: C6H12O6
CH$EXACT_MASS: 180.156
CH$SMILES: C1C(OCC(O1)(CO)O)(CO)O
CH$IUPAC: InChI=1S/C6H12O6/c7-1-5(9)3-12-6(10,2-8)4-11-5/h7-10H,1-4H2
CH$LINK: CAS 62147-49-3
CH$LINK: PUBCHEM CID:4180364
CH$LINK: INCHIKEY KEQUNHIAUQQPAC-UHFFFAOYSA-N
CH$LINK: COMPTOX DTXSID6040165

AC$INSTRUMENT: TQD, Waters
AC$INSTRUMENT_TYPE: LC-ESI-QQ
AC$MASS_SPECTROMETRY: MS_TYPE MS2
AC$MASS_SPECTROMETRY: ION_MODE POSITIVE
AC$MASS_SPECTROMETRY: IONIZATION ESI
AC$MASS_SPECTROMETRY: COLLISION_ENERGY 60

MS$FOCUSED_ION: ION_TYPE [M+H]+
MS$FOCUSED_ION: PRECURSOR_M/Z 180.17

PK$SPLASH: splash10-000i-0900000000-18f751f19f76390bda5f
PK$NUM_PEAK: 1
PK$PEAK: m/z int. rel.int.
  137.0 347494.0 999