ACCESSION: MSBNK-RIKEN_ReSpect-PT101270
RECORD_TITLE: beta-Ala-His, L-Carnosine, L-Ignotine, (2S)-2-(3-aminopropanoylamino)-3-(3H-imidazol-4-yl)propanoic acid, beta-Alanyl-L-histidine; LC-ESI-QTOF; MS2
DATE: 2008.07.24
AUTHORS: Matsuda F, Suzuki M, Sawada Y, Plant Science Center, RIKEN.
LICENSE: CC BY-NC
COPYRIGHT: Copyright(C) 2009 Plant Science Center, RIKEN
COMMENT: Build 1 2009/06/24
COMMENT: Acquisition and generation of the data is financially supported in part by CREST/JST.

CH$NAME: beta-Ala-His
CH$NAME: L-Carnosine
CH$NAME: L-Ignotine
CH$NAME: (2S)-2-(3-aminopropanoylamino)-3-(3H-imidazol-4-yl)propanoic acid
CH$NAME: beta-Alanyl-L-histidine
CH$COMPOUND_CLASS: CLASS1 Amino acid CLASS2 Peptide CLASS3 Oligopeptide
CH$FORMULA: C9H14N4O3
CH$EXACT_MASS: 226.236
CH$SMILES: C1=C(NC=N1)CC(C(=O)O)NC(=O)CCN
CH$IUPAC: InChI=1S/C9H14N4O3/c10-2-1-8(14)13-7(9(15)16)3-6-4-11-5-12-6/h4-5,7H,1-3,10H2,(H,11,12)(H,13,14)(H,15,16)
CH$LINK: CAS 305-84-0
CH$LINK: INCHIKEY CQOVPNPJLQNMDC-UHFFFAOYSA-N

AC$INSTRUMENT: Q-Tof Premier, Waters
AC$INSTRUMENT_TYPE: LC-ESI-QTOF
AC$MASS_SPECTROMETRY: MS_TYPE MS2
AC$MASS_SPECTROMETRY: ION_MODE POSITIVE
AC$MASS_SPECTROMETRY: IONIZATION ESI
AC$MASS_SPECTROMETRY: COLLISION_ENERGY Ramp 5-45 V
AC$MASS_SPECTROMETRY: CAPILLARY_VOLTAGE 3.0 kV
AC$CHROMATOGRAPHY: SOLVENT CH3CN/H2O

MS$FOCUSED_ION: ION_TYPE [M+H]+
MS$FOCUSED_ION: PRECURSOR_M/Z 227.11439

PK$SPLASH: splash10-004i-0090000000-1687007acad9a504c843
PK$NUM_PEAK: 2
PK$PEAK: m/z int. rel.int.
  156.0782 69.12 71
  227.1144 966.1 999