ACCESSION: MSBNK-RIKEN_ReSpect-PT203140
RECORD_TITLE: 2-Hydroxycinnamic acid, predominantly trans , 2-Coumarate, o-Coumaric acid, (E)-3-(2-hydroxyphenyl)prop-2-enoic acid, (E)-3-(2-Hydroxyphenyl)-2-propenoic acid; LC-ESI-QTOF; MS2
DATE: 2008.07.28
AUTHORS: Matsuda F, Suzuki M, Sawada Y, Plant Science Center, RIKEN.
LICENSE: CC BY-NC
COPYRIGHT: Copyright(C) 2009 Plant Science Center, RIKEN
COMMENT: Build 1 2009/06/24
COMMENT: Acquisition and generation of the data is financially supported in part by CREST/JST.

CH$NAME: 2-Hydroxycinnamic acid, predominantly trans
CH$NAME: 2-Coumarate
CH$NAME: o-Coumaric acid
CH$NAME: (E)-3-(2-hydroxyphenyl)prop-2-enoic acid
CH$NAME: (E)-3-(2-Hydroxyphenyl)-2-propenoic acid
CH$COMPOUND_CLASS: CLASS1 Phenylpropanoid CLASS2 Phenylpropanoid monomer CLASS3 Coumaric acid
CH$FORMULA: C9H8O3
CH$EXACT_MASS: 164.16
CH$SMILES: C1=CC=C(C(=C1)C=CC(=O)O)O
CH$IUPAC: InChI=1S/C9H8O3/c10-8-4-2-1-3-7(8)5-6-9(11)12/h1-6,10H,(H,11,12)
CH$LINK: CAS 614-60-8
CH$LINK: INCHIKEY PMOWTIHVNWZYFI-UHFFFAOYSA-N

AC$INSTRUMENT: Q-Tof Premier, Waters
AC$INSTRUMENT_TYPE: LC-ESI-QTOF
AC$MASS_SPECTROMETRY: MS_TYPE MS2
AC$MASS_SPECTROMETRY: ION_MODE NEGATIVE
AC$MASS_SPECTROMETRY: IONIZATION ESI
AC$MASS_SPECTROMETRY: COLLISION_ENERGY Ramp 5-45 V
AC$MASS_SPECTROMETRY: CAPILLARY_VOLTAGE 3.0 kV
AC$CHROMATOGRAPHY: SOLVENT CH3CN/H2O

MS$FOCUSED_ION: ION_TYPE [M-H]-
MS$FOCUSED_ION: PRECURSOR_M/Z 163.03954

PK$SPLASH: splash10-03di-0900000000-adbaf7b04487b18191e0
PK$NUM_PEAK: 2
PK$PEAK: m/z int. rel.int.
  119.0501 518.7 430
  162.8392 1204.0 999