ACCESSION: MSBNK-RIKEN_ReSpect-PT206030
RECORD_TITLE: [[(2R,3S,4R)-5-(2,4-dioxopyrimidin-1-yl)-3,4-dihydroxyoxolan-2-yl]methoxy-hydroxyphosphoryl] [(2R,3R,4R,5R,6S)-3,4,5-trihydroxy-6-methyloxan-2-yl] hydrogen phosphate, UDP-beta-L-rhamnose, UDP-Rha; LC-ESI-QTOF; MS2
DATE: 2008.07.28
AUTHORS: Matsuda F, Suzuki M, Sawada Y, Plant Science Center, RIKEN.
LICENSE: CC BY-NC
COPYRIGHT: Copyright(C) 2009 Plant Science Center, RIKEN
COMMENT: Build 1 2009/06/24
COMMENT: Acquisition and generation of the data is financially supported in part by CREST/JST.

CH$NAME: [[(2R,3S,4R)-5-(2,4-dioxopyrimidin-1-yl)-3,4-dihydroxyoxolan-2-yl]methoxy-hydroxyphosphoryl] [(2R,3R,4R,5R,6S)-3,4,5-trihydroxy-6-methyloxan-2-yl] hydrogen phosphate
CH$NAME: UDP-beta-L-rhamnose
CH$NAME: UDP-Rha
CH$COMPOUND_CLASS: CLASS1 Other CLASS2 Nucleotide CLASS3 Uridine phosphate
CH$FORMULA: C15H24N2O16P2
CH$EXACT_MASS: 550.307
CH$SMILES: CC1C(C(C(C(O1)OP(=O)(O)OP(=O)(O)OCC2C(C(C(O2)N3C=CC(=O)NC3=O)O)O)O)O)O
CH$IUPAC: InChI=1S/C15H24N2O16P2/c1-5-8(19)10(21)12(23)14(30-5)32-35(27,28)33-34(25,26)29-4-6-9(20)11(22)13(31-6)17-3-2-7(18)16-15(17)24/h2-3,5-6,8-14,19-23H,4H2,1H3,(H,25,26)(H,27,28)(H,16,18,24)
CH$LINK: CAS 1955-26-6
CH$LINK: INCHIKEY DRDCJEIZVLVWNC-UHFFFAOYSA-N

AC$INSTRUMENT: Q-Tof Premier, Waters
AC$INSTRUMENT_TYPE: LC-ESI-QTOF
AC$MASS_SPECTROMETRY: MS_TYPE MS2
AC$MASS_SPECTROMETRY: ION_MODE NEGATIVE
AC$MASS_SPECTROMETRY: IONIZATION ESI
AC$MASS_SPECTROMETRY: COLLISION_ENERGY Ramp 5-45 V
AC$MASS_SPECTROMETRY: CAPILLARY_VOLTAGE 3.0 kV
AC$CHROMATOGRAPHY: SOLVENT CH3CN/H2O

MS$FOCUSED_ION: ION_TYPE [M-H]-
MS$FOCUSED_ION: PRECURSOR_M/Z 549.0523

PK$SPLASH: splash10-052b-5614390000-8207db0554e68840adca
PK$NUM_PEAK: 14
PK$PEAK: m/z int. rel.int.
  78.9601 250.4 504
  96.97 71.26 143
  111.02 99.27 200
  158.9256 248.2 499
  174.9791 15.19 31
  176.9365 17.18 35
  211.0 14.51 29
  225.0176 12.57 25
  272.9575 82.38 166
  305.0035 51.78 104
  323.0289 101.2 204
  384.9846 92.21 185
  402.9948 166.7 335
  549.0523 496.8 999