ACCESSION: MSBNK-CASMI_2016-SM865051
RECORD_TITLE: 4-Bromophenol; LC-ESI-QFT; MS2; CE: 35 NCE; R=35000; [M-H]-
DATE: 2016.12.12
AUTHORS: Krauss M, Schymanski EL, Weidauer C, Schupke H, UFZ and Eawag
LICENSE: CC BY
COPYRIGHT: Copyright (C) 2016 UFZ/Eawag
PUBLICATION: Schymanski, E. L.; Ruttkies, C.; Krauss, M.; Brouard, C.; Kind, T.; Dührkop, K.; Allen, F.; Vaniya, A.; Verdegem, D.; Böcker, S.; et al. Critical Assessment of Small Molecule Identification 2016: Automated Methods. Journal of Cheminformatics 2017, 9 (1). DOI:10.1186/s13321-017-0207-1
COMMENT: CONFIDENCE Reference Standard (Level 1)
COMMENT: INTERNAL_ID 8650

CH$NAME: 4-Bromophenol
CH$COMPOUND_CLASS: N/A; Environmental Standard
CH$FORMULA: C6H5BrO
CH$EXACT_MASS: 171.95238
CH$SMILES: Oc1ccc(Br)cc1
CH$IUPAC: InChI=1S/C6H5BrO/c7-5-1-3-6(8)4-2-5/h1-4,8H
CH$LINK: CAS 106-41-2
CH$LINK: PUBCHEM CID:7808
CH$LINK: INCHIKEY GZFGOTFRPZRKDS-UHFFFAOYSA-N
CH$LINK: CHEMSPIDER 13842573
CH$LINK: COMPTOX DTXSID3051543

AC$INSTRUMENT: Q Exactive Plus Orbitrap Thermo Scientific
AC$INSTRUMENT_TYPE: LC-ESI-QFT
AC$MASS_SPECTROMETRY: MS_TYPE MS2
AC$MASS_SPECTROMETRY: ION_MODE NEGATIVE
AC$MASS_SPECTROMETRY: IONIZATION ESI
AC$MASS_SPECTROMETRY: FRAGMENTATION_MODE HCD
AC$MASS_SPECTROMETRY: COLLISION_ENERGY 35 (nominal)
AC$MASS_SPECTROMETRY: RESOLUTION 35000
AC$CHROMATOGRAPHY: COLUMN_NAME Kinetex C18 EVO 2.6 um, 2.1x50 mm, precolumn 2.1x5 mm, Phenomenex
AC$CHROMATOGRAPHY: FLOW_GRADIENT 95/5 at 0 min, 95/5 at 1 min, 0/100 at 13 min, 0/100 at 24 min
AC$CHROMATOGRAPHY: FLOW_RATE 300 uL/min
AC$CHROMATOGRAPHY: RETENTION_TIME 8.428 min
AC$CHROMATOGRAPHY: SOLVENT A water with 0.1% formic acid
AC$CHROMATOGRAPHY: SOLVENT B methanol with 0.1% formic acid

MS$FOCUSED_ION: BASE_PEAK 112.9848
MS$FOCUSED_ION: PRECURSOR_M/Z 170.9451
MS$FOCUSED_ION: PRECURSOR_TYPE [M-H]-
MS$DATA_PROCESSING: RECALIBRATE loess on assigned fragments and MS1
MS$DATA_PROCESSING: REANALYZE Peaks with additional N2/O included
MS$DATA_PROCESSING: WHOLE RMassBank 2.3.1

PK$SPLASH: splash10-00di-0900000000-dc052e1db76d1c94a81f
PK$ANNOTATION: m/z tentative_formula formula_count mass error(ppm)
  142.9466 BrH4N2O2- 1 142.9462 3.01
  170.9451 C6H4BrO- 1 170.9451 0.27
PK$NUM_PEAK: 2
PK$PEAK: m/z int. rel.int.
  142.9466 16576.6 67
  170.9451 246863.9 999