ACCESSION: MSBNK-Univ_Toyama-TY000082
RECORD_TITLE: Demethoxycurcumin; LC-ESI-ITTOF; MS; [M-H]-
DATE: 2016.01.19 (Created 2008.12.13, modified 2011.05.06)
AUTHORS: Ken TANAKA
LICENSE: CC BY-SA

CH$NAME: Demethoxycurcumin
CH$NAME: 1,6-Heptadiene-3,5-dione, 1-(4-hydroxy-3-methoxyphenyl)-7-(4-hydroxyphenyl)-, (1E,6E)-
CH$NAME: 1,6-Heptadiene-3,5-dione, 1-(4-hydroxy-3-methoxyphenyl)-7-(p-hydroxyphenyl)-
CH$NAME: (1E,6E)-1-(4-Hydroxyphenyl)-7-(4-hydroxy-3-methoxyphenyl)-1,6-heptadiene-3,5-dione
CH$NAME: Curcumin II
CH$NAME: Desmethoxycurcumin
CH$NAME: Monodemethoxycurcumin
CH$COMPOUND_CLASS: Natural Product; Diarylheptanoid
CH$FORMULA: C20H18O5
CH$EXACT_MASS: 338.11542
CH$SMILES: COc(c1)c(O)ccc(C=CC(=O)CC(=O)C=Cc(c2)ccc(O)c2)1
CH$IUPAC: InChI=1S/C20H18O5/c1-25-20-12-15(6-11-19(20)24)5-10-18(23)13-17(22)9-4-14-2-7-16(21)8-3-14/h2-12,21,24H,13H2,1H3/b9-4+,10-5+
CH$LINK: CAS 22608-11-3
CH$LINK: NIKKAJI J468.369B
CH$LINK: PUBCHEM CID:5469424
CH$LINK: INCHIKEY HJTVQHVGMGKONQ-LUZURFALSA-N
CH$LINK: COMPTOX DTXSID00873751

AC$INSTRUMENT: Shimadzu LC20A-IT-TOFMS
AC$INSTRUMENT_TYPE: LC-ESI-ITTOF
AC$MASS_SPECTROMETRY: MS_TYPE MS
AC$MASS_SPECTROMETRY: ION_MODE NEGATIVE
AC$MASS_SPECTROMETRY: CDL_TEMPERATURE 200 C
AC$MASS_SPECTROMETRY: INTERFACE_VOLTAGE -3.50 kV
AC$MASS_SPECTROMETRY: SCANNING 0.1 sec/scan
AC$MASS_SPECTROMETRY: SCANNING_RANGE 100-1500
AC$CHROMATOGRAPHY: COLUMN_NAME Waters Atlantis T3 (2.1 x 150 mm, 5 um)
AC$CHROMATOGRAPHY: COLUMN_TEMPERATURE 40 C
AC$CHROMATOGRAPHY: FLOW_GRADIENT 10 % B to 100 % B/40 min
AC$CHROMATOGRAPHY: FLOW_RATE 0.2 ml/min
AC$CHROMATOGRAPHY: RETENTION_TIME 1297.663 sec
AC$CHROMATOGRAPHY: SOLVENT A 5 mM ammonium acetate
AC$CHROMATOGRAPHY: SOLVENT B CH3CN

MS$FOCUSED_ION: ION_TYPE [M-H]-

PK$SPLASH: splash10-000i-0009000000-e01a2a9954cd54a3d966
PK$NUM_PEAK: 2
PK$PEAK: m/z int. rel.int.
  337.1080 144898741 999
  338.1119 34037669 235