ACCESSION: MSBNK-Waters-WA000299
RECORD_TITLE: Temazepam; LC-ESI-Q; MS; POS; 30 V
DATE: 2016.01.19 (Created 2007.08.01, modified 2011.05.06)
AUTHORS: Nihon Waters K.K.
LICENSE: CC BY-NC

CH$NAME: Temazepam
CH$COMPOUND_CLASS: N/A
CH$FORMULA: C16H13ClN2O2
CH$EXACT_MASS: 300.06656
CH$SMILES: Clc(c3)cc(c(c3)2)C(=NC(O)C(=O)N(C)2)c(c1)cccc1
CH$IUPAC: InChI=1S/C16H13ClN2O2/c1-19-13-8-7-11(17)9-12(13)14(18-15(20)16(19)21)10-5-3-2-4-6-10/h2-9,15,20H,1H3
CH$LINK: CAS 846-50-4
CH$LINK: INCHIKEY SEQDDYPDSLOBDC-UHFFFAOYSA-N
CH$LINK: COMPTOX DTXSID8021309

AC$INSTRUMENT: ZQ, Waters
AC$INSTRUMENT_TYPE: LC-ESI-Q
AC$MASS_SPECTROMETRY: MS_TYPE MS
AC$MASS_SPECTROMETRY: ION_MODE POSITIVE
AC$MASS_SPECTROMETRY: IONIZATION ESI
AC$CHROMATOGRAPHY: RETENTION_TIME 15.850 min
AC$CHROMATOGRAPHY: COLUMN_NAME 2.1 mm id - 3. 5{mu}m XTerra C18MS
AC$CHROMATOGRAPHY: COLUMN_TEMPERATURE 35 C
AC$CHROMATOGRAPHY: SAMPLING_CONE 30 V

MS$DATA_PROCESSING: FIND_PEAK ignore rel.int. < 5

PK$SPLASH: splash10-0udi-0049000000-7e34c95c6be84a3fd32c
PK$NUM_PEAK: 23
PK$PEAK: m/z int. rel.int.
  228 8 8
  240 27 27
  255 212 212
  256 27 27
  257 67 67
  258 12 12
  283 415 415
  284 59 59
  285 141 141
  286 20 20
  301 999 999
  302 149 149
  303 345 345
  304 51 51
  323 149 149
  324 20 20
  325 55 55
  326 8 8
  339 27 27
  341 12 12
  343 8 8
  364 16 16
  366 8 8