ACCESSION: MSBNK-Waters-WA000326
RECORD_TITLE: Zolpidem; LC-ESI-Q; MS; POS; 45 V
DATE: 2016.01.19 (Created 2007.08.01, modified 2011.05.06)
AUTHORS: Nihon Waters K.K.
LICENSE: CC BY-NC

CH$NAME: Zolpidem
CH$COMPOUND_CLASS: N/A
CH$FORMULA: C19H21N3O
CH$EXACT_MASS: 307.16846
CH$SMILES: CN(C)C(=O)Cc(n32)c(nc(C=CC(C)=C3)2)c(c1)ccc(C)c1
CH$IUPAC: InChI=1S/C19H21N3O/c1-13-5-8-15(9-6-13)19-16(11-18(23)21(3)4)22-12-14(2)7-10-17(22)20-19/h5-10,12H,11H2,1-4H3
CH$LINK: CAS 82626-48-0
CH$LINK: INCHIKEY ZAFYATHCZYHLPB-UHFFFAOYSA-N
CH$LINK: COMPTOX DTXSID7045946

AC$INSTRUMENT: ZQ, Waters
AC$INSTRUMENT_TYPE: LC-ESI-Q
AC$MASS_SPECTROMETRY: MS_TYPE MS
AC$MASS_SPECTROMETRY: ION_MODE POSITIVE
AC$MASS_SPECTROMETRY: IONIZATION ESI
AC$CHROMATOGRAPHY: RETENTION_TIME 12.140 min
AC$CHROMATOGRAPHY: COLUMN_NAME 2.1 mm id - 3. 5{mu}m XTerra C18MS
AC$CHROMATOGRAPHY: COLUMN_TEMPERATURE 35 C
AC$CHROMATOGRAPHY: SAMPLING_CONE 45 V

MS$DATA_PROCESSING: FIND_PEAK ignore rel.int. < 5

PK$SPLASH: splash10-0a4i-0019000000-26ca4f675829590e53dc
PK$NUM_PEAK: 8
PK$PEAK: m/z int. rel.int.
  235 47 47
  236 39 39
  237 8 8
  263 55 55
  264 8 8
  308 999 999
  309 298 298
  310 27 27