ACCESSION: MSBNK-Waters-WA000335
RECORD_TITLE: Hydrochlorothiazide; LC-ESI-Q; MS; NEG; 90 V
DATE: 2016.01.19 (Created 2007.08.01, modified 2011.05.06)
AUTHORS: Nihon Waters K.K.
LICENSE: CC BY-NC

CH$NAME: Hydrochlorothiazide
CH$COMPOUND_CLASS: N/A
CH$FORMULA: C7H8ClN3O4S2
CH$EXACT_MASS: 296.96447
CH$SMILES: Clc(c2)c(cc(c12)S(=O)(=O)NCN1)S(N)(=O)=O
CH$IUPAC: InChI=1S/C7H8ClN3O4S2/c8-4-1-5-7(2-6(4)16(9,12)13)17(14,15)11-3-10-5/h1-2,10-11H,3H2,(H2,9,12,13)
CH$LINK: CAS 58-93-5
CH$LINK: INCHIKEY JZUFKLXOESDKRF-UHFFFAOYSA-N
CH$LINK: COMPTOX DTXSID2020713

AC$INSTRUMENT: ZQ, Waters
AC$INSTRUMENT_TYPE: LC-ESI-Q
AC$MASS_SPECTROMETRY: MS_TYPE MS
AC$MASS_SPECTROMETRY: ION_MODE NEGATIVE
AC$MASS_SPECTROMETRY: IONIZATION ESI
AC$CHROMATOGRAPHY: RETENTION_TIME 10.000 min
AC$CHROMATOGRAPHY: COLUMN_NAME 2.1 mm id - 3. 5{mu}m XTerra C18MS
AC$CHROMATOGRAPHY: COLUMN_TEMPERATURE 35 C
AC$CHROMATOGRAPHY: SAMPLING_CONE 90 V

MS$DATA_PROCESSING: FIND_PEAK ignore rel.int. < 5

PK$SPLASH: splash10-0ab9-0960000000-8c3b79bc713e82363ed4
PK$NUM_PEAK: 112
PK$PEAK: m/z int. rel.int.
  104 509 509
  105 278 278
  106 31 31
  114 16 16
  115 161 161
  116 114 114
  117 294 294
  119 35 35
  120 16 16
  121 548 548
  122 78 78
  124 537 537
  125 129 129
  126 795 795
  128 255 255
  129 20 20
  131 27 27
  132 94 94
  133 12 12
  135 8 8
  137 98 98
  138 31 31
  140 20 20
  141 78 78
  142 12 12
  143 8 8
  144 39 39
  146 59 59
  147 16 16
  148 74 74
  151 39 39
  152 35 35
  153 16 16
  154 141 141
  155 31 31
  159 12 12
  161 8 8
  164 12 12
  166 16 16
  168 55 55
  169 118 118
  170 20 20
  171 12 12
  173 8 8
  178 12 12
  179 125 125
  180 47 47
  181 47 47
  184 8 8
  189 20 20
  190 157 157
  191 24 24
  192 31 31
  194 47 47
  195 43 43
  196 12 12
  197 16 16
  198 8 8
  203 270 270
  204 255 255
  205 999 999
  206 172 172
  207 435 435
  209 51 51
  210 27 27
  212 16 16
  214 8 8
  215 12 12
  216 12 12
  217 16 16
  218 8 8
  219 12 12
  220 12 12
  222 8 8
  230 12 12
  231 8 8
  232 82 82
  234 24 24
  235 12 12
  239 12 12
  240 8 8
  241 12 12
  243 55 55
  244 24 24
  259 31 31
  260 55 55
  261 12 12
  269 435 435
  270 16 16
  271 180 180
  272 39 39
  274 12 12
  279 12 12
  289 8 8
  293 12 12
  294 8 8
  295 20 20
  296 439 439
  297 20 20
  298 168 168
  299 27 27
  300 16 16
  304 8 8
  307 262 262
  309 106 106
  311 39 39
  317 8 8
  318 20 20
  320 8 8
  322 8 8
  325 12 12
  329 8 8