ACCESSION: MSBNK-Waters-WA000444
RECORD_TITLE: Valpromide; LC-ESI-Q; MS; POS; 60 V
DATE: 2016.01.19 (Created 2007.08.01, modified 2011.05.06)
AUTHORS: Nihon Waters K.K.
LICENSE: CC BY-NC

CH$NAME: Valpromide
CH$COMPOUND_CLASS: N/A
CH$FORMULA: C8H17NO
CH$EXACT_MASS: 143.13101
CH$SMILES: CCCC(CCC)C(N)=O
CH$IUPAC: InChI=1S/C8H17NO/c1-3-5-7(6-4-2)8(9)10/h7H,3-6H2,1-2H3,(H2,9,10)
CH$LINK: CAS 2430-27-5
CH$LINK: INCHIKEY OMOMUFTZPTXCHP-UHFFFAOYSA-N
CH$LINK: COMPTOX DTXSID1023734

AC$INSTRUMENT: ZQ, Waters
AC$INSTRUMENT_TYPE: LC-ESI-Q
AC$MASS_SPECTROMETRY: MS_TYPE MS
AC$MASS_SPECTROMETRY: ION_MODE POSITIVE
AC$MASS_SPECTROMETRY: IONIZATION ESI
AC$CHROMATOGRAPHY: RETENTION_TIME 14.060 min
AC$CHROMATOGRAPHY: COLUMN_NAME 2.1 mm id - 3. 5{mu}m XTerra C18MS
AC$CHROMATOGRAPHY: COLUMN_TEMPERATURE 35 C
AC$CHROMATOGRAPHY: SAMPLING_CONE 60 V

MS$DATA_PROCESSING: FIND_PEAK ignore rel.int. < 5

PK$SPLASH: splash10-001r-9600000000-4302dbeb6e5acbf8cfd7
PK$NUM_PEAK: 40
PK$PEAK: m/z int. rel.int.
  79 78 78
  80 27 27
  81 682 682
  82 983 983
  84 443 443
  85 168 168
  86 165 165
  88 858 858
  94 31 31
  96 74 74
  97 71 71
  98 302 302
  99 47 47
  101 24 24
  102 157 157
  107 27 27
  109 82 82
  110 12 12
  111 71 71
  113 78 78
  114 16 16
  116 740 740
  117 12 12
  123 12 12
  125 24 24
  126 306 306
  127 16 16
  129 12 12
  130 20 20
  132 12 12
  135 12 12
  137 16 16
  142 27 27
  144 999 999
  145 55 55
  157 35 35
  172 12 12
  178 20 20
  185 35 35
  186 20 20