ACCESSION: MSBNK-Waters-WA000619
RECORD_TITLE: Tofisopam; LC-ESI-Q; MS; POS; 90 V
DATE: 2016.01.19 (Created 2007.08.01, modified 2011.05.06)
AUTHORS: Nihon Waters K.K.
LICENSE: CC BY-NC

CH$NAME: Tofisopam
CH$COMPOUND_CLASS: N/A
CH$FORMULA: C22H26N2O4
CH$EXACT_MASS: 382.18926
CH$SMILES: COc(c3)c(OC)cc(c3)C(=N1)c(c2)c(cc(OC)c(OC)2)C(CC)C(C)=N1
CH$IUPAC: InChI=1S/C22H26N2O4/c1-7-15-13(2)23-24-22(14-8-9-18(25-3)19(10-14)26-4)17-12-21(28-6)20(27-5)11-16(15)17/h8-12,15H,7H2,1-6H3
CH$LINK: CAS 22345-47-7
CH$LINK: INCHIKEY RUJBDQSFYCKFAA-UHFFFAOYSA-N
CH$LINK: COMPTOX DTXSID3023681

AC$INSTRUMENT: ZQ, Waters
AC$INSTRUMENT_TYPE: LC-ESI-Q
AC$MASS_SPECTROMETRY: MS_TYPE MS
AC$MASS_SPECTROMETRY: ION_MODE POSITIVE
AC$MASS_SPECTROMETRY: IONIZATION ESI
AC$CHROMATOGRAPHY: RETENTION_TIME 15.840 min
AC$CHROMATOGRAPHY: COLUMN_NAME 2.1 mm id - 3. 5{mu}m XTerra C18MS
AC$CHROMATOGRAPHY: COLUMN_TEMPERATURE 35 C
AC$CHROMATOGRAPHY: SAMPLING_CONE 90 V

MS$DATA_PROCESSING: FIND_PEAK ignore rel.int. < 5

PK$SPLASH: splash10-0002-0194000000-504fb85d968686cdd201
PK$NUM_PEAK: 144
PK$PEAK: m/z int. rel.int.
  107 8 8
  117 8 8
  121 12 12
  123 12 12
  131 8 8
  132 43 43
  133 16 16
  136 8 8
  138 16 16
  143 12 12
  145 20 20
  146 27 27
  147 8 8
  148 20 20
  149 8 8
  151 35 35
  158 12 12
  159 12 12
  160 82 82
  161 16 16
  162 8 8
  164 20 20
  165 12 12
  171 12 12
  172 8 8
  173 35 35
  174 27 27
  176 106 106
  177 74 74
  178 12 12
  186 12 12
  187 8 8
  188 59 59
  189 55 55
  190 27 27
  191 16 16
  196 8 8
  201 20 20
  202 24 24
  204 74 74
  205 16 16
  207 8 8
  208 16 16
  209 16 16
  210 12 12
  211 8 8
  212 8 8
  215 8 8
  216 8 8
  217 8 8
  221 12 12
  222 8 8
  223 8 8
  224 31 31
  225 39 39
  226 35 35
  227 8 8
  231 35 35
  232 8 8
  235 12 12
  236 20 20
  237 55 55
  238 31 31
  239 51 51
  240 71 71
  241 16 16
  242 12 12
  245 8 8
  247 8 8
  248 8 8
  249 16 16
  250 20 20
  251 20 20
  252 118 118
  253 55 55
  254 192 192
  255 94 94
  256 16 16
  261 8 8
  262 8 8
  263 20 20
  264 24 24
  265 51 51
  266 39 39
  267 141 141
  268 161 161
  269 251 251
  270 223 223
  271 31 31
  276 8 8
  277 24 24
  278 24 24
  279 35 35
  280 78 78
  281 102 102
  282 149 149
  283 94 94
  284 39 39
  290 8 8
  291 12 12
  292 20 20
  293 51 51
  294 39 39
  295 106 106
  296 239 239
  297 157 157
  298 999 999
  299 145 145
  300 12 12
  305 8 8
  306 16 16
  307 31 31
  308 67 67
  309 59 59
  310 82 82
  311 86 86
  312 47 47
  313 306 306
  314 51 51
  320 16 16
  321 27 27
  322 31 31
  323 86 86
  324 31 31
  325 141 141
  326 306 306
  327 71 71
  328 12 12
  336 27 27
  337 51 51
  338 39 39
  339 176 176
  340 31 31
  342 94 94
  343 16 16
  351 47 47
  352 59 59
  353 67 67
  354 31 31
  366 8 8
  367 192 192
  368 43 43
  383 86 86
  384 16 16