ACCESSION: MSBNK-Waters-WA000663
RECORD_TITLE: Nor-LSD; LC-ESI-Q; MS; POS; 30 V
DATE: 2016.01.19 (Created 2007.08.01, modified 2011.05.06)
AUTHORS: Nihon Waters K.K.
LICENSE: CC BY-NC

CH$NAME: Nor-LSD
CH$COMPOUND_CLASS: N/A
CH$FORMULA: C19H23N3O
CH$EXACT_MASS: 309.18411
CH$SMILES: CCN(CC)C(=O)[C@H]1CN[C@@H]2CC3=CNC4=CC=CC(=C34)C2=C1
CH$IUPAC: InChI=1S/C19H23N3O/c1-3-22(4-2)19(23)13-8-15-14-6-5-7-16-18(14)12(10-20-16)9-17(15)21-11-13/h5-8,10,13,17,20-21H,3-4,9,11H2,1-2H3/t13-,17-/m1/s1
CH$LINK: CAS 35779-43-2
CH$LINK: INCHIKEY SUXLVXOMPKZBOV-CXAGYDPISA-N
CH$LINK: COMPTOX DTXSID80189307

AC$INSTRUMENT: ZQ, Waters
AC$INSTRUMENT_TYPE: LC-ESI-Q
AC$MASS_SPECTROMETRY: MS_TYPE MS
AC$MASS_SPECTROMETRY: ION_MODE POSITIVE
AC$MASS_SPECTROMETRY: IONIZATION ESI
AC$CHROMATOGRAPHY: RETENTION_TIME 12.600 min
AC$CHROMATOGRAPHY: COLUMN_NAME 2.1 mm id - 3. 5{mu}m XTerra C18MS
AC$CHROMATOGRAPHY: COLUMN_TEMPERATURE 35 C
AC$CHROMATOGRAPHY: SAMPLING_CONE 30 V

MS$DATA_PROCESSING: FIND_PEAK ignore rel.int. < 5

PK$SPLASH: splash10-03di-0009000000-d5664d0f1768412c7fb9
PK$NUM_PEAK: 8
PK$PEAK: m/z int. rel.int.
  183 12 12
  209 24 24
  237 20 20
  310 999 999
  311 204 204
  312 20 20
  342 20 20
  619 8 8