ACCESSION: MSBNK-Waters-WA000668
RECORD_TITLE: Cocaethylene; LC-ESI-Q; MS; POS; 45 V
DATE: 2016.01.19 (Created 2007.08.01, modified 2011.05.06)
AUTHORS: Nihon Waters K.K.
LICENSE: CC BY-NC

CH$NAME: Cocaethylene
CH$COMPOUND_CLASS: N/A
CH$FORMULA: C18H23NO4
CH$EXACT_MASS: 317.16271
CH$SMILES: CCOC(=O)C(C(OC(=O)c(c3)cccc3)1)C(C2)N(C)C(C2)C1
CH$IUPAC: InChI=1S/C18H23NO4/c1-3-22-18(21)16-14-10-9-13(19(14)2)11-15(16)23-17(20)12-7-5-4-6-8-12/h4-8,13-16H,3,9-11H2,1-2H3/t13-,14+,15-,16+/m0/s1
CH$LINK: CAS 529-38-4
CH$LINK: INCHIKEY NMPOSNRHZIWLLL-XUWVNRHRSA-N
CH$LINK: COMPTOX DTXSID20873213

AC$INSTRUMENT: ZQ, Waters
AC$INSTRUMENT_TYPE: LC-ESI-Q
AC$MASS_SPECTROMETRY: MS_TYPE MS
AC$MASS_SPECTROMETRY: ION_MODE POSITIVE
AC$MASS_SPECTROMETRY: IONIZATION ESI
AC$CHROMATOGRAPHY: RETENTION_TIME 12.400 min
AC$CHROMATOGRAPHY: COLUMN_NAME 2.1 mm id - 3. 5{mu}m XTerra C18MS
AC$CHROMATOGRAPHY: COLUMN_TEMPERATURE 35 C
AC$CHROMATOGRAPHY: SAMPLING_CONE 45 V

MS$DATA_PROCESSING: FIND_PEAK ignore rel.int. < 5

PK$SPLASH: splash10-0002-0902000000-75d3d730d0b2f0af2847
PK$NUM_PEAK: 13
PK$PEAK: m/z int. rel.int.
  105 12 12
  108 35 35
  119 16 16
  122 8 8
  150 55 55
  168 20 20
  184 12 12
  196 999 999
  197 98 98
  198 8 8
  272 12 12
  318 251 251
  319 43 43