ACCESSION: MSBNK-Waters-WA000688
RECORD_TITLE: Propafenone; LC-ESI-Q; MS; POS; 30 V
DATE: 2016.01.19 (Created 2007.08.01, modified 2011.05.06)
AUTHORS: Nihon Waters K.K.
LICENSE: CC BY-NC

CH$NAME: Propafenone
CH$COMPOUND_CLASS: N/A
CH$FORMULA: C21H27NO3
CH$EXACT_MASS: 341.19909
CH$SMILES: CCCNCC(O)COc(c2)c(ccc2)C(=O)CCc(c1)cccc1
CH$IUPAC: InChI=1S/C21H27NO3/c1-2-14-22-15-18(23)16-25-21-11-7-6-10-19(21)20(24)13-12-17-8-4-3-5-9-17/h3-11,18,22-23H,2,12-16H2,1H3
CH$LINK: CAS 54063-53-5
CH$LINK: INCHIKEY JWHAUXFOSRPERK-UHFFFAOYSA-N
CH$LINK: COMPTOX DTXSID9045184

AC$INSTRUMENT: ZQ, Waters
AC$INSTRUMENT_TYPE: LC-ESI-Q
AC$MASS_SPECTROMETRY: MS_TYPE MS
AC$MASS_SPECTROMETRY: ION_MODE POSITIVE
AC$MASS_SPECTROMETRY: IONIZATION ESI
AC$CHROMATOGRAPHY: RETENTION_TIME 14.600 min
AC$CHROMATOGRAPHY: COLUMN_NAME 2.1 mm id - 3. 5{mu}m XTerra C18MS
AC$CHROMATOGRAPHY: COLUMN_TEMPERATURE 35 C
AC$CHROMATOGRAPHY: SAMPLING_CONE 30 V

MS$DATA_PROCESSING: FIND_PEAK ignore rel.int. < 5

PK$SPLASH: splash10-0006-0209000000-5e903e1af4737e77d03e
PK$NUM_PEAK: 9
PK$PEAK: m/z int. rel.int.
  116 313 313
  117 24 24
  265 12 12
  324 86 86
  325 20 20
  342 999 999
  343 231 231
  344 31 31
  364 8 8