ACCESSION: MSBNK-Waters-WA000697
RECORD_TITLE: Prazepam; LC-ESI-Q; MS; POS; 90 V
DATE: 2016.01.19 (Created 2007.08.01, modified 2011.05.06)
AUTHORS: Nihon Waters K.K.
LICENSE: CC BY-NC

CH$NAME: Prazepam
CH$COMPOUND_CLASS: N/A
CH$FORMULA: C19H17ClN2O
CH$EXACT_MASS: 324.10294
CH$SMILES: Clc(c3)cc(C=1c(c4)cccc4)c(c3)N(CC(C2)C2)C(=O)CN1
CH$IUPAC: InChI=1S/C19H17ClN2O/c20-15-8-9-17-16(10-15)19(14-4-2-1-3-5-14)21-11-18(23)22(17)12-13-6-7-13/h1-5,8-10,13H,6-7,11-12H2
CH$LINK: CAS 2955-38-6
CH$LINK: INCHIKEY MWQCHHACWWAQLJ-UHFFFAOYSA-N
CH$LINK: COMPTOX DTXSID4021181

AC$INSTRUMENT: ZQ, Waters
AC$INSTRUMENT_TYPE: LC-ESI-Q
AC$MASS_SPECTROMETRY: MS_TYPE MS
AC$MASS_SPECTROMETRY: ION_MODE POSITIVE
AC$MASS_SPECTROMETRY: IONIZATION ESI
AC$CHROMATOGRAPHY: RETENTION_TIME 18.800 min
AC$CHROMATOGRAPHY: COLUMN_NAME 2.1 mm id - 3. 5{mu}m XTerra C18MS
AC$CHROMATOGRAPHY: COLUMN_TEMPERATURE 35 C
AC$CHROMATOGRAPHY: SAMPLING_CONE 90 V

MS$DATA_PROCESSING: FIND_PEAK ignore rel.int. < 5

PK$SPLASH: splash10-05mo-0940000000-f2fa00eabccb5102325d
PK$NUM_PEAK: 102
PK$PEAK: m/z int. rel.int.
  102 12 12
  103 27 27
  104 161 161
  105 141 141
  106 24 24
  111 12 12
  113 67 67
  114 8 8
  115 20 20
  116 184 184
  117 78 78
  118 59 59
  123 8 8
  124 12 12
  125 12 12
  126 8 8
  127 67 67
  129 51 51
  130 106 106
  131 27 27
  132 12 12
  133 39 39
  138 121 121
  140 999 999
  141 47 47
  142 341 341
  143 27 27
  144 20 20
  145 8 8
  150 39 39
  151 20 20
  152 35 35
  153 24 24
  154 12 12
  155 8 8
  157 16 16
  158 145 145
  159 16 16
  163 27 27
  164 20 20
  165 670 670
  166 137 137
  167 208 208
  168 55 55
  170 12 12
  177 8 8
  178 24 24
  179 31 31
  180 141 141
  181 74 74
  182 12 12
  190 55 55
  191 133 133
  192 55 55
  193 243 243
  194 39 39
  195 12 12
  199 24 24
  201 16 16
  203 8 8
  204 16 16
  205 12 12
  206 74 74
  207 196 196
  208 650 650
  209 86 86
  214 82 82
  215 12 12
  216 55 55
  217 24 24
  218 67 67
  219 55 55
  220 16 16
  221 8 8
  226 118 118
  227 90 90
  228 78 78
  229 35 35
  230 16 16
  232 12 12
  233 12 12
  234 12 12
  235 20 20
  236 8 8
  238 24 24
  240 16 16
  241 145 145
  242 59 59
  243 141 141
  244 31 31
  245 31 31
  252 8 8
  253 16 16
  255 31 31
  257 12 12
  269 12 12
  271 231 231
  272 31 31
  273 86 86
  274 8 8
  325 20 20
  327 8 8