ACCESSION: MSBNK-Waters-WA000706
RECORD_TITLE: Piretanide; LC-ESI-Q; MS; POS; 30 V
DATE: 2016.01.19 (Created 2007.08.01, modified 2011.05.06)
AUTHORS: Nihon Waters K.K.
LICENSE: CC BY-NC

CH$NAME: Piretanide
CH$COMPOUND_CLASS: N/A
CH$FORMULA: C17H18N2O5S
CH$EXACT_MASS: 362.09364
CH$SMILES: OC(=O)c(c1)cc(S(N)(=O)=O)c(Oc(c3)cccc3)c1N(C2)CCC2
CH$IUPAC: InChI=1S/C17H18N2O5S/c18-25(22,23)15-11-12(17(20)21)10-14(19-8-4-5-9-19)16(15)24-13-6-2-1-3-7-13/h1-3,6-7,10-11H,4-5,8-9H2,(H,20,21)(H2,18,22,23)
CH$LINK: CAS 55837-27-9
CH$LINK: INCHIKEY UJEWTUDSLQGTOA-UHFFFAOYSA-N
CH$LINK: COMPTOX DTXSID2023488

AC$INSTRUMENT: ZQ, Waters
AC$INSTRUMENT_TYPE: LC-ESI-Q
AC$MASS_SPECTROMETRY: MS_TYPE MS
AC$MASS_SPECTROMETRY: ION_MODE POSITIVE
AC$MASS_SPECTROMETRY: IONIZATION ESI
AC$CHROMATOGRAPHY: RETENTION_TIME 16.200 min
AC$CHROMATOGRAPHY: COLUMN_NAME 2.1 mm id - 3. 5{mu}m XTerra C18MS
AC$CHROMATOGRAPHY: COLUMN_TEMPERATURE 35 C
AC$CHROMATOGRAPHY: SAMPLING_CONE 30 V

MS$DATA_PROCESSING: FIND_PEAK ignore rel.int. < 5

PK$SPLASH: splash10-03di-0009000000-0e49ce0c4836ef9b231d
PK$NUM_PEAK: 10
PK$PEAK: m/z int. rel.int.
  238 8 8
  240 24 24
  282 12 12
  343 12 12
  361 12 12
  363 999 999
  364 118 118
  365 67 67
  366 8 8
  401 24 24