ACCESSION: MSBNK-Waters-WA000730
RECORD_TITLE: Oxazepam; LC-ESI-Q; MS; NEG; 30 V
DATE: 2016.01.19 (Created 2007.08.01, modified 2011.05.06)
AUTHORS: Nihon Waters K.K.
LICENSE: CC BY-NC

CH$NAME: Oxazepam
CH$COMPOUND_CLASS: N/A
CH$FORMULA: C15H11ClN2O2
CH$EXACT_MASS: 286.05091
CH$SMILES: Clc(c3)cc(c(c3)2)C(=NC(O)C(=O)N2)c(c1)cccc1
CH$IUPAC: InChI=1S/C15H11ClN2O2/c16-10-6-7-12-11(8-10)13(9-4-2-1-3-5-9)18-15(20)14(19)17-12/h1-8,15,20H,(H,17,19)/t15-/m0/s1
CH$LINK: CAS 604-75-1
CH$LINK: INCHIKEY ADIMAYPTOBDMTL-HNNXBMFYSA-N

AC$INSTRUMENT: ZQ, Waters
AC$INSTRUMENT_TYPE: LC-ESI-Q
AC$MASS_SPECTROMETRY: MS_TYPE MS
AC$MASS_SPECTROMETRY: ION_MODE NEGATIVE
AC$MASS_SPECTROMETRY: IONIZATION ESI
AC$CHROMATOGRAPHY: RETENTION_TIME 15.100 min
AC$CHROMATOGRAPHY: COLUMN_NAME 2.1 mm id - 3. 5{mu}m XTerra C18MS
AC$CHROMATOGRAPHY: COLUMN_TEMPERATURE 35 C
AC$CHROMATOGRAPHY: SAMPLING_CONE 30 V

MS$DATA_PROCESSING: FIND_PEAK ignore rel.int. < 5

PK$SPLASH: splash10-000i-0091100000-a4b8c528b4cc3f5b29f5
PK$NUM_PEAK: 117
PK$PEAK: m/z int. rel.int.
  101 39 39
  106 12 12
  118 12 12
  126 12 12
  129 12 12
  152 20 20
  158 12 12
  170 16 16
  175 8 8
  180 8 8
  205 8 8
  213 12 12
  217 8 8
  218 8 8
  228 8 8
  231 8 8
  235 12 12
  239 8 8
  242 16 16
  244 67 67
  246 12 12
  248 8 8
  254 8 8
  257 114 114
  259 35 35
  261 8 8
  264 8 8
  267 12 12
  268 8 8
  269 8 8
  276 12 12
  277 12 12
  283 8 8
  285 999 999
  286 180 180
  287 384 384
  288 133 133
  289 12 12
  294 8 8
  296 8 8
  299 12 12
  311 8 8
  314 8 8
  317 8 8
  319 12 12
  322 12 12
  323 8 8
  326 8 8
  327 8 8
  342 8 8
  344 24 24
  348 31 31
  349 16 16
  350 35 35
  351 8 8
  353 8 8
  355 43 43
  357 8 8
  365 8 8
  367 8 8
  369 8 8
  372 12 12
  377 12 12
  380 8 8
  385 16 16
  386 8 8
  387 8 8
  393 8 8
  394 8 8
  415 8 8
  418 8 8
  423 8 8
  426 20 20
  428 8 8
  430 8 8
  433 8 8
  442 12 12
  445 27 27
  448 8 8
  449 8 8
  455 16 16
  458 12 12
  460 16 16
  463 8 8
  470 8 8
  474 8 8
  476 8 8
  487 8 8
  489 8 8
  490 8 8
  492 8 8
  494 8 8
  497 8 8
  501 12 12
  506 8 8
  512 20 20
  514 8 8
  515 12 12
  518 12 12
  521 8 8
  530 8 8
  534 8 8
  545 8 8
  550 12 12
  563 12 12
  566 12 12
  574 8 8
  576 8 8
  585 8 8
  587 8 8
  607 8 8
  611 8 8
  613 8 8
  616 8 8
  617 8 8
  634 12 12
  638 16 16