ACCESSION: MSBNK-Waters-WA000845
RECORD_TITLE: Cyclothiazide; LC-ESI-Q; MS; POS; 30 V
DATE: 2016.01.19 (Created 2007.08.01, modified 2011.05.06)
AUTHORS: Nihon Waters K.K.
LICENSE: CC BY-NC

CH$NAME: Cyclothiazide
CH$COMPOUND_CLASS: N/A
CH$FORMULA: C14H16ClN3O4S2
CH$EXACT_MASS: 389.02708
CH$SMILES: Clc(c4)c(cc(c43)S(=O)(=O)NC(N3)C(C1)C(C=2)CC(C2)1)S(N)(=O)=O
CH$IUPAC: InChI=1S/C14H16ClN3O4S2/c15-10-5-11-13(6-12(10)23(16,19)20)24(21,22)18-14(17-11)9-4-7-1-2-8(9)3-7/h1-2,5-9,14,17-18H,3-4H2,(H2,16,19,20)
CH$LINK: CAS 2259-96-3
CH$LINK: INCHIKEY BOCUKUHCLICSIY-UHFFFAOYSA-N
CH$LINK: COMPTOX DTXSID3022871

AC$INSTRUMENT: ZQ, Waters
AC$INSTRUMENT_TYPE: LC-ESI-Q
AC$MASS_SPECTROMETRY: MS_TYPE MS
AC$MASS_SPECTROMETRY: ION_MODE POSITIVE
AC$MASS_SPECTROMETRY: IONIZATION ESI
AC$CHROMATOGRAPHY: RETENTION_TIME 15.900 min
AC$CHROMATOGRAPHY: COLUMN_NAME 2.1 mm id - 3. 5{mu}m XTerra C18MS
AC$CHROMATOGRAPHY: COLUMN_TEMPERATURE 35 C
AC$CHROMATOGRAPHY: SAMPLING_CONE 30 V

MS$DATA_PROCESSING: FIND_PEAK ignore rel.int. < 5

PK$SPLASH: splash10-0ab9-0109600000-1833383a3f6d0ac1ae10
PK$NUM_PEAK: 79
PK$PEAK: m/z int. rel.int.
  104 20 20
  105 24 24
  109 47 47
  112 8 8
  116 8 8
  119 16 16
  121 12 12
  122 16 16
  123 8 8
  126 20 20
  128 16 16
  133 43 43
  136 8 8
  139 16 16
  142 12 12
  146 12 12
  150 16 16
  151 8 8
  160 31 31
  167 24 24
  172 8 8
  179 8 8
  180 8 8
  191 8 8
  192 12 12
  203 16 16
  207 27 27
  220 8 8
  226 8 8
  227 31 31
  251 12 12
  265 12 12
  269 24 24
  271 16 16
  284 8 8
  285 20 20
  295 43 43
  303 8 8
  312 8 8
  319 12 12
  321 35 35
  324 999 999
  325 74 74
  326 419 419
  327 31 31
  328 24 24
  329 16 16
  331 12 12
  353 59 59
  354 8 8
  361 24 24
  363 12 12
  365 47 47
  366 8 8
  367 12 12
  369 55 55
  370 8 8
  371 27 27
  373 31 31
  375 20 20
  379 8 8
  390 341 341
  391 47 47
  392 94 94
  393 12 12
  402 20 20
  404 27 27
  405 8 8
  407 842 842
  408 133 133
  409 404 404
  410 47 47
  411 24 24
  412 12 12
  422 8 8
  423 12 12
  428 110 110
  430 47 47
  431 8 8