ACCESSION: MSBNK-Waters-WA000865
RECORD_TITLE: Trimethoprim; LC-ESI-Q; MS; POS; 75 V
DATE: 2016.01.19 (Created 2007.08.01, modified 2011.05.06)
AUTHORS: Nihon Waters K.K.
LICENSE: CC BY-NC

CH$NAME: Trimethoprim
CH$COMPOUND_CLASS: N/A
CH$FORMULA: C14H18N4O3
CH$EXACT_MASS: 290.13789
CH$SMILES: COc(c1)c(OC)c(OC)cc(Cc(c2)c(N)nc(N)n2)1
CH$IUPAC: InChI=1S/C14H18N4O3/c1-19-10-5-8(6-11(20-2)12(10)21-3)4-9-7-17-14(16)18-13(9)15/h5-7H,4H2,1-3H3,(H4,15,16,17,18)
CH$LINK: CAS 738-70-5
CH$LINK: INCHIKEY IEDVJHCEMCRBQM-UHFFFAOYSA-N
CH$LINK: COMPTOX DTXSID3023712

AC$INSTRUMENT: ZQ, Waters
AC$INSTRUMENT_TYPE: LC-ESI-Q
AC$MASS_SPECTROMETRY: MS_TYPE MS
AC$MASS_SPECTROMETRY: ION_MODE POSITIVE
AC$MASS_SPECTROMETRY: IONIZATION ESI
AC$CHROMATOGRAPHY: RETENTION_TIME 10.250 min
AC$CHROMATOGRAPHY: COLUMN_NAME 2.1 mm id - 3. 5{mu}m XTerra C18MS
AC$CHROMATOGRAPHY: COLUMN_TEMPERATURE 35 C
AC$CHROMATOGRAPHY: SAMPLING_CONE 75 V

MS$DATA_PROCESSING: FIND_PEAK ignore rel.int. < 5

PK$SPLASH: splash10-0230-0790000000-9a1cad2b0dffa5ca3c55
PK$NUM_PEAK: 74
PK$PEAK: m/z int. rel.int.
  81 219 219
  83 8 8
  95 8 8
  106 16 16
  107 12 12
  110 309 309
  111 129 129
  120 8 8
  121 8 8
  123 999 999
  124 47 47
  131 8 8
  135 27 27
  137 71 71
  146 24 24
  147 8 8
  148 16 16
  149 74 74
  151 51 51
  156 8 8
  161 51 51
  162 55 55
  163 12 12
  165 20 20
  167 8 8
  170 8 8
  171 8 8
  173 31 31
  174 78 78
  175 27 27
  176 8 8
  181 8 8
  185 8 8
  186 8 8
  187 78 78
  188 12 12
  189 8 8
  190 67 67
  191 31 31
  199 24 24
  200 20 20
  201 98 98
  202 27 27
  203 35 35
  205 8 8
  212 8 8
  213 8 8
  214 8 8
  215 55 55
  216 47 47
  217 35 35
  218 12 12
  229 153 153
  230 149 149
  231 67 67
  232 149 149
  233 451 451
  234 35 35
  242 8 8
  243 12 12
  244 8 8
  245 247 247
  246 31 31
  247 63 63
  248 8 8
  257 223 223
  258 39 39
  259 51 51
  261 294 294
  262 31 31
  275 243 243
  276 24 24
  291 59 59
  292 8 8