ACCESSION: MSBNK-Waters-WA000866
RECORD_TITLE: Trimethoprim; LC-ESI-Q; MS; POS; 90 V
DATE: 2016.01.19 (Created 2007.08.01, modified 2011.05.06)
AUTHORS: Nihon Waters K.K.
LICENSE: CC BY-NC

CH$NAME: Trimethoprim
CH$COMPOUND_CLASS: N/A
CH$FORMULA: C14H18N4O3
CH$EXACT_MASS: 290.13789
CH$SMILES: COc(c1)c(OC)c(OC)cc(Cc(c2)c(N)nc(N)n2)1
CH$IUPAC: InChI=1S/C14H18N4O3/c1-19-10-5-8(6-11(20-2)12(10)21-3)4-9-7-17-14(16)18-13(9)15/h5-7H,4H2,1-3H3,(H4,15,16,17,18)
CH$LINK: CAS 738-70-5
CH$LINK: INCHIKEY IEDVJHCEMCRBQM-UHFFFAOYSA-N
CH$LINK: COMPTOX DTXSID3023712

AC$INSTRUMENT: ZQ, Waters
AC$INSTRUMENT_TYPE: LC-ESI-Q
AC$MASS_SPECTROMETRY: MS_TYPE MS
AC$MASS_SPECTROMETRY: ION_MODE POSITIVE
AC$MASS_SPECTROMETRY: IONIZATION ESI
AC$CHROMATOGRAPHY: RETENTION_TIME 10.250 min
AC$CHROMATOGRAPHY: COLUMN_NAME 2.1 mm id - 3. 5{mu}m XTerra C18MS
AC$CHROMATOGRAPHY: COLUMN_TEMPERATURE 35 C
AC$CHROMATOGRAPHY: SAMPLING_CONE 90 V

MS$DATA_PROCESSING: FIND_PEAK ignore rel.int. < 5

PK$SPLASH: splash10-0230-1920000000-7c5a9746483ac3eb0634
PK$NUM_PEAK: 97
PK$PEAK: m/z int. rel.int.
  80 86 86
  81 490 490
  83 35 35
  86 8 8
  91 39 39
  93 16 16
  94 12 12
  95 35 35
  97 16 16
  104 20 20
  105 24 24
  106 43 43
  107 78 78
  109 20 20
  110 380 380
  111 55 55
  113 12 12
  115 20 20
  117 12 12
  118 24 24
  119 27 27
  121 39 39
  123 999 999
  124 63 63
  128 16 16
  129 24 24
  130 27 27
  131 98 98
  132 35 35
  133 31 31
  135 137 137
  137 86 86
  140 8 8
  142 24 24
  143 24 24
  144 8 8
  145 51 51
  146 114 114
  148 63 63
  149 141 141
  151 35 35
  154 8 8
  156 35 35
  157 16 16
  158 31 31
  159 31 31
  161 380 380
  162 200 200
  163 31 31
  165 31 31
  167 12 12
  170 31 31
  171 16 16
  172 27 27
  173 102 102
  174 106 106
  175 106 106
  176 24 24
  182 8 8
  183 12 12
  184 20 20
  185 35 35
  186 20 20
  187 114 114
  188 27 27
  189 47 47
  190 118 118
  191 27 27
  197 8 8
  198 16 16
  199 43 43
  200 24 24
  201 74 74
  202 20 20
  203 55 55
  204 12 12
  205 8 8
  213 16 16
  214 16 16
  215 63 63
  216 31 31
  217 31 31
  218 16 16
  229 67 67
  230 16 16
  231 153 153
  232 110 110
  233 208 208
  234 16 16
  243 8 8
  245 90 90
  247 24 24
  257 43 43
  259 16 16
  261 39 39
  275 39 39
  291 51 51