ACCESSION: MSBNK-Waters-WA000907
RECORD_TITLE: alpha-Hydroxytriazolam; LC-ESI-Q; MS; POS; 75 V
DATE: 2016.01.19 (Created 2007.08.01, modified 2011.05.06)
AUTHORS: Nihon Waters K.K.
LICENSE: CC BY-NC

CH$NAME: alpha-Hydroxytriazolam
CH$COMPOUND_CLASS: N/A
CH$FORMULA: C17H12Cl2N4O
CH$EXACT_MASS: 358.03882
CH$SMILES: OCc(n4)n(c(n4)2)c(c3)c(cc(Cl)c3)C(=NC2)c(c1)c(Cl)ccc1
CH$IUPAC: InChI=1S/C17H12Cl2N4O/c18-10-5-6-14-12(7-10)17(11-3-1-2-4-13(11)19)20-8-15-21-22-16(9-24)23(14)15/h1-7,24H,8-9H2
CH$LINK: CAS 37115-45-0
CH$LINK: INCHIKEY BHUYWUDMVCLHND-UHFFFAOYSA-N
CH$LINK: COMPTOX DTXSID50958284

AC$INSTRUMENT: ZQ, Waters
AC$INSTRUMENT_TYPE: LC-ESI-Q
AC$MASS_SPECTROMETRY: MS_TYPE MS
AC$MASS_SPECTROMETRY: ION_MODE POSITIVE
AC$MASS_SPECTROMETRY: IONIZATION ESI
AC$CHROMATOGRAPHY: RETENTION_TIME 14.800 min
AC$CHROMATOGRAPHY: COLUMN_NAME 2.1 mm id - 3. 5{mu}m XTerra C18MS
AC$CHROMATOGRAPHY: COLUMN_TEMPERATURE 35 C
AC$CHROMATOGRAPHY: SAMPLING_CONE 75 V

MS$DATA_PROCESSING: FIND_PEAK ignore rel.int. < 5

PK$SPLASH: splash10-06vi-0479000000-de439df3873324c21363
PK$NUM_PEAK: 129
PK$PEAK: m/z int. rel.int.
  125 59 59
  127 20 20
  136 8 8
  137 27 27
  138 98 98
  139 8 8
  140 141 141
  141 215 215
  142 39 39
  149 78 78
  150 12 12
  151 20 20
  165 24 24
  166 16 16
  167 8 8
  168 8 8
  169 8 8
  174 16 16
  176 686 686
  177 51 51
  178 247 247
  179 20 20
  181 35 35
  187 12 12
  190 27 27
  191 8 8
  201 39 39
  202 8 8
  203 12 12
  204 110 110
  205 12 12
  206 43 43
  214 24 24
  215 16 16
  216 24 24
  217 35 35
  219 20 20
  222 8 8
  225 16 16
  227 8 8
  231 12 12
  237 74 74
  238 55 55
  239 118 118
  240 27 27
  241 31 31
  242 90 90
  243 165 165
  244 27 27
  245 74 74
  246 8 8
  247 24 24
  250 145 145
  251 71 71
  252 114 114
  253 31 31
  254 27 27
  261 153 153
  262 16 16
  263 90 90
  264 8 8
  265 16 16
  266 129 129
  267 24 24
  268 43 43
  269 8 8
  272 82 82
  273 16 16
  274 86 86
  275 12 12
  276 39 39
  277 204 204
  278 306 306
  279 114 114
  280 106 106
  281 12 12
  286 106 106
  287 55 55
  288 82 82
  289 35 35
  290 24 24
  291 12 12
  296 8 8
  297 12 12
  301 8 8
  302 8 8
  303 12 12
  305 20 20
  306 74 74
  307 16 16
  308 24 24
  313 247 247
  314 35 35
  315 157 157
  316 24 24
  317 24 24
  324 31 31
  325 12 12
  326 16 16
  331 392 392
  332 59 59
  333 278 278
  334 39 39
  335 43 43
  341 121 121
  342 12 12
  343 78 78
  344 12 12
  345 8 8
  348 8 8
  359 999 999
  360 129 129
  361 733 733
  362 102 102
  363 114 114
  364 20 20
  377 8 8
  381 35 35
  382 55 55
  383 31 31
  384 35 35
  385 8 8
  386 8 8
  397 74 74
  399 59 59
  400 12 12
  401 12 12
  422 16 16
  424 12 12