ACCESSION: MSBNK-Waters-WA000991
RECORD_TITLE: Codeine; LC-ESI-Q; MS; POS; 90 V
DATE: 2016.01.19 (Created 2007.08.01, modified 2011.05.06)
AUTHORS: Nihon Waters K.K.
LICENSE: CC BY-NC

CH$NAME: Codeine
CH$COMPOUND_CLASS: N/A
CH$FORMULA: C18H21NO3
CH$EXACT_MASS: 299.15214
CH$SMILES: CN1CC[C@]23[C@@H]4[C@H]1CC5=C2C(=C(C=C5)OC)O[C@H]3[C@H](C=C4)O
CH$IUPAC: InChI=1S/C18H21NO3/c1-19-8-7-18-11-4-5-13(20)17(18)22-16-14(21-2)6-3-10(15(16)18)9-12(11)19/h3-6,11-13,17,20H,7-9H2,1-2H3/t11-,12+,13-,17-,18-/m0/s1
CH$LINK: CAS 76-57-3
CH$LINK: INCHIKEY OROGSEYTTFOCAN-DNJOTXNNSA-N
CH$LINK: COMPTOX DTXSID2020341

AC$INSTRUMENT: ZQ, Waters
AC$INSTRUMENT_TYPE: LC-ESI-Q
AC$MASS_SPECTROMETRY: MS_TYPE MS
AC$MASS_SPECTROMETRY: ION_MODE POSITIVE
AC$MASS_SPECTROMETRY: IONIZATION ESI
AC$CHROMATOGRAPHY: RETENTION_TIME 8.700 min
AC$CHROMATOGRAPHY: COLUMN_NAME 2.1 mm id - 3. 5{mu}m XTerra C18MS
AC$CHROMATOGRAPHY: COLUMN_TEMPERATURE 35 C
AC$CHROMATOGRAPHY: SAMPLING_CONE 90 V

MS$DATA_PROCESSING: FIND_PEAK ignore rel.int. < 5

PK$SPLASH: splash10-0ul0-0910000000-379efa8fe9b1a2b29dce
PK$NUM_PEAK: 132
PK$PEAK: m/z int. rel.int.
  103 59 59
  105 27 27
  106 16 16
  107 27 27
  108 8 8
  109 8 8
  110 16 16
  115 196 196
  116 59 59
  118 31 31
  119 20 20
  120 12 12
  121 63 63
  122 27 27
  124 8 8
  127 12 12
  128 251 251
  129 176 176
  130 27 27
  131 94 94
  132 20 20
  133 12 12
  134 16 16
  135 8 8
  136 8 8
  137 157 157
  138 16 16
  139 16 16
  140 8 8
  141 317 317
  142 74 74
  143 47 47
  144 376 376
  145 55 55
  146 74 74
  148 24 24
  149 20 20
  150 12 12
  151 12 12
  152 266 266
  153 999 999
  154 247 247
  155 423 423
  156 235 235
  157 43 43
  158 125 125
  159 282 282
  160 31 31
  161 368 368
  162 39 39
  163 12 12
  164 16 16
  165 396 396
  166 114 114
  167 98 98
  168 243 243
  169 266 266
  170 212 212
  171 615 615
  172 262 262
  174 63 63
  175 78 78
  176 31 31
  177 59 59
  178 63 63
  179 63 63
  180 98 98
  181 541 541
  182 290 290
  183 451 451
  184 145 145
  185 321 321
  186 133 133
  187 168 168
  188 31 31
  189 31 31
  192 27 27
  193 74 74
  194 149 149
  195 149 149
  196 39 39
  197 321 321
  198 317 317
  199 466 466
  200 165 165
  202 20 20
  203 12 12
  205 51 51
  206 12 12
  207 51 51
  208 102 102
  210 200 200
  212 78 78
  213 184 184
  214 27 27
  215 168 168
  216 27 27
  217 8 8
  218 8 8
  219 16 16
  220 55 55
  221 82 82
  223 208 208
  224 39 39
  225 188 188
  226 78 78
  228 24 24
  234 8 8
  235 27 27
  236 55 55
  238 20 20
  239 39 39
  241 141 141
  242 20 20
  243 43 43
  244 8 8
  248 20 20
  249 8 8
  250 24 24
  251 20 20
  252 16 16
  253 8 8
  254 8 8
  266 51 51
  267 27 27
  282 12 12
  285 8 8
  300 168 168
  301 27 27
  318 20 20
  322 35 35
  323 8 8