ACCESSION: MSBNK-Waters-WA001043
RECORD_TITLE: Lorazepam; LC-ESI-Q; MS; POS; 90 V
DATE: 2016.01.19 (Created 2007.08.01, modified 2011.05.06)
AUTHORS: Nihon Waters K.K.
LICENSE: CC BY-NC

CH$NAME: Lorazepam
CH$COMPOUND_CLASS: N/A
CH$FORMULA: C15H10Cl2N2O2
CH$EXACT_MASS: 320.01193
CH$SMILES: Clc(c3)cc(c(c3)2)C(=NC(O)C(=O)N2)c(c1)c(Cl)ccc1
CH$IUPAC: InChI=1S/C15H10Cl2N2O2/c16-8-5-6-12-10(7-8)13(19-15(21)14(20)18-12)9-3-1-2-4-11(9)17/h1-7,15,21H,(H,18,20)
CH$LINK: CAS 846-49-1
CH$LINK: INCHIKEY DIWRORZWFLOCLC-UHFFFAOYSA-N
CH$LINK: COMPTOX DTXSID7023225

AC$INSTRUMENT: ZQ, Waters
AC$INSTRUMENT_TYPE: LC-ESI-Q
AC$MASS_SPECTROMETRY: MS_TYPE MS
AC$MASS_SPECTROMETRY: ION_MODE POSITIVE
AC$MASS_SPECTROMETRY: IONIZATION ESI
AC$CHROMATOGRAPHY: RETENTION_TIME 15.20 min
AC$CHROMATOGRAPHY: COLUMN_NAME 2.1 mm id - 3. 5{mu}m XTerra C18MS
AC$CHROMATOGRAPHY: COLUMN_TEMPERATURE 35 C
AC$CHROMATOGRAPHY: SAMPLING_CONE 90 V

MS$DATA_PROCESSING: FIND_PEAK ignore rel.int. < 5

PK$SPLASH: splash10-003f-0941000000-48d2a41297e74da1dccd
PK$NUM_PEAK: 114
PK$PEAK: m/z int. rel.int.
  100 27 27
  102 376 376
  103 24 24
  105 8 8
  108 8 8
  111 59 59
  113 27 27
  115 8 8
  117 35 35
  118 270 270
  119 12 12
  120 149 149
  121 12 12
  124 16 16
  126 63 63
  127 16 16
  128 110 110
  129 24 24
  130 564 564
  131 47 47
  135 8 8
  136 39 39
  138 682 682
  139 102 102
  140 219 219
  141 35 35
  143 78 78
  144 16 16
  145 8 8
  151 31 31
  152 39 39
  153 90 90
  154 31 31
  155 31 31
  156 12 12
  163 329 329
  164 94 94
  165 121 121
  166 102 102
  167 74 74
  168 47 47
  169 16 16
  177 168 168
  178 43 43
  179 86 86
  180 8 8
  181 35 35
  186 31 31
  192 27 27
  193 129 129
  194 999 999
  195 157 157
  196 8 8
  202 8 8
  203 20 20
  204 78 78
  205 129 129
  206 47 47
  212 12 12
  213 35 35
  214 35 35
  215 12 12
  216 8 8
  221 20 20
  228 35 35
  229 925 925
  230 114 114
  231 290 290
  232 31 31
  239 188 188
  240 31 31
  241 71 71
  242 12 12
  248 16 16
  250 16 16
  255 12 12
  257 24 24
  259 8 8
  263 86 86
  265 71 71
  267 12 12
  273 20 20
  275 243 243
  276 24 24
  277 172 172
  278 24 24
  279 24 24
  291 35 35
  293 27 27
  294 8 8
  295 8 8
  303 20 20
  305 8 8
  321 35 35
  323 20 20
  325 31 31
  327 20 20
  343 255 255
  344 27 27
  345 172 172
  346 24 24
  347 31 31
  359 192 192
  360 20 20
  361 141 141
  362 16 16
  363 39 39
  365 16 16
  366 8 8
  367 8 8
  384 39 39
  386 24 24
  387 8 8
  389 8 8