ACCESSION: MSBNK-Waters-WA001048
RECORD_TITLE: Lorazepam; LC-ESI-Q; MS; POS; 15 V
DATE: 2016.01.19 (Created 2007.08.01, modified 2011.05.06)
AUTHORS: Nihon Waters K.K.
LICENSE: CC BY-NC

CH$NAME: Lorazepam
CH$COMPOUND_CLASS: N/A
CH$FORMULA: C15H10Cl2N2O2
CH$EXACT_MASS: 320.01193
CH$SMILES: Clc(c3)cc(c(c3)2)C(=NC(O)C(=O)N2)c(c1)c(Cl)ccc1
CH$IUPAC: InChI=1S/C15H10Cl2N2O2/c16-8-5-6-12-10(7-8)13(19-15(21)14(20)18-12)9-3-1-2-4-11(9)17/h1-7,15,21H,(H,18,20)
CH$LINK: CAS 846-49-1
CH$LINK: INCHIKEY DIWRORZWFLOCLC-UHFFFAOYSA-N
CH$LINK: COMPTOX DTXSID7023225

AC$INSTRUMENT: ZQ, Waters
AC$INSTRUMENT_TYPE: LC-ESI-Q
AC$MASS_SPECTROMETRY: MS_TYPE MS
AC$MASS_SPECTROMETRY: ION_MODE POSITIVE
AC$MASS_SPECTROMETRY: IONIZATION ESI
AC$CHROMATOGRAPHY: RETENTION_TIME 15.200 min
AC$CHROMATOGRAPHY: COLUMN_NAME 2.1 mm id - 3. 5{mu}m XTerra C18MS
AC$CHROMATOGRAPHY: COLUMN_TEMPERATURE 35 C
AC$CHROMATOGRAPHY: SAMPLING_CONE 15 V

MS$DATA_PROCESSING: FIND_PEAK ignore rel.int. < 5

PK$SPLASH: splash10-00di-0009000000-9ba1a9b4c38bf76146a5
PK$NUM_PEAK: 17
PK$PEAK: m/z int. rel.int.
  275 8 8
  321 999 999
  322 106 106
  323 697 697
  324 90 90
  325 118 118
  326 16 16
  343 63 63
  344 8 8
  345 43 43
  346 8 8
  347 12 12
  359 43 43
  361 39 39
  363 12 12
  384 12 12
  386 12 12