ACCESSION: MSBNK-Waters-WA001050
RECORD_TITLE: MDMA (Ecstasy); LC-ESI-Q; MS; POS; 75 V, 90 V
DATE: 2016.01.19 (Created 2007.08.01, modified 2011.05.06)
AUTHORS: Nihon Waters K.K.
LICENSE: CC BY-NC

CH$NAME: MDMA (Ecstasy)
CH$COMPOUND_CLASS: N/A
CH$FORMULA: C11H15NO2
CH$EXACT_MASS: 193.11028
CH$SMILES: CNC(C)Cc(c1)cc(O2)c(OC2)c1
CH$IUPAC: InChI=1S/C11H15NO2/c1-8(12-2)5-9-3-4-10-11(6-9)14-7-13-10/h3-4,6,8,12H,5,7H2,1-2H3
CH$LINK: CAS 42542-10-9
CH$LINK: INCHIKEY SHXWCVYOXRDMCX-UHFFFAOYSA-N
CH$LINK: COMPTOX DTXSID90860791

AC$INSTRUMENT: ZQ, Waters
AC$INSTRUMENT_TYPE: LC-ESI-Q
AC$MASS_SPECTROMETRY: MS_TYPE MS
AC$MASS_SPECTROMETRY: ION_MODE POSITIVE
AC$MASS_SPECTROMETRY: IONIZATION ESI
AC$CHROMATOGRAPHY: RETENTION_TIME 10.300 min
AC$CHROMATOGRAPHY: COLUMN_NAME 2.1 mm id - 3. 5{mu}m XTerra C18MS
AC$CHROMATOGRAPHY: COLUMN_TEMPERATURE 35 C
AC$CHROMATOGRAPHY: SAMPLING_CONE 75 V, 90 V

MS$DATA_PROCESSING: FIND_PEAK ignore rel.int. < 5

PK$SPLASH: splash10-0pb9-0900000000-1807f8fe75ffd21b3b53
PK$NUM_PEAK: 19
PK$PEAK: m/z int. rel.int.
  102 12 12
  103 584 584
  105 999 999
  106 47 47
  115 35 35
  116 8 8
  118 168 168
  119 8 8
  121 114 114
  122 35 35
  131 8 8
  133 47 47
  135 396 396
  136 31 31
  144 8 8
  147 121 121
  148 43 43
  163 12 12
  194 8 8