ACCESSION: MSBNK-Waters-WA001075
RECORD_TITLE: Midazolam; LC-ESI-Q; MS; POS; 90 V
DATE: 2016.01.19 (Created 2007.08.01, modified 2011.05.06)
AUTHORS: Nihon Waters K.K.
LICENSE: CC BY-NC

CH$NAME: Midazolam
CH$COMPOUND_CLASS: N/A
CH$FORMULA: C18H13ClFN3
CH$EXACT_MASS: 325.07820
CH$SMILES: Clc(c3)cc(C=1c(c4)c(F)ccc4)c(c3)n(c(C)2)c(cn2)CN1
CH$IUPAC: InChI=1S/C18H13ClFN3/c1-11-21-9-13-10-22-18(14-4-2-3-5-16(14)20)15-8-12(19)6-7-17(15)23(11)13/h2-9H,10H2,1H3
CH$LINK: CAS 59467-70-8
CH$LINK: INCHIKEY DDLIGBOFAVUZHB-UHFFFAOYSA-N
CH$LINK: COMPTOX DTXSID5023320

AC$INSTRUMENT: ZQ, Waters
AC$INSTRUMENT_TYPE: LC-ESI-Q
AC$MASS_SPECTROMETRY: MS_TYPE MS
AC$MASS_SPECTROMETRY: ION_MODE POSITIVE
AC$MASS_SPECTROMETRY: IONIZATION ESI
AC$CHROMATOGRAPHY: RETENTION_TIME 13.360 min
AC$CHROMATOGRAPHY: COLUMN_NAME 2.1 mm id - 3. 5{mu}m XTerra C18MS
AC$CHROMATOGRAPHY: COLUMN_TEMPERATURE 35 C
AC$CHROMATOGRAPHY: SAMPLING_CONE 90 V

MS$DATA_PROCESSING: FIND_PEAK ignore rel.int. < 5

PK$SPLASH: splash10-05fv-0490000000-f034aec80860c4ee72b2
PK$NUM_PEAK: 190
PK$PEAK: m/z int. rel.int.
  101 31 31
  102 200 200
  103 16 16
  109 55 55
  111 43 43
  113 39 39
  115 39 39
  116 16 16
  117 16 16
  119 20 20
  120 8 8
  121 82 82
  122 39 39
  123 74 74
  124 8 8
  125 8 8
  126 8 8
  127 39 39
  128 176 176
  129 458 458
  130 47 47
  131 8 8
  133 35 35
  134 12 12
  136 20 20
  137 118 118
  138 24 24
  139 67 67
  140 20 20
  141 12 12
  142 43 43
  143 24 24
  144 8 8
  146 51 51
  147 71 71
  148 71 71
  149 12 12
  150 12 12
  151 8 8
  152 125 125
  153 39 39
  154 67 67
  155 51 51
  156 12 12
  160 12 12
  162 121 121
  163 165 165
  164 192 192
  165 78 78
  166 47 47
  167 8 8
  168 24 24
  169 63 63
  170 121 121
  171 20 20
  173 27 27
  174 16 16
  175 20 20
  176 27 27
  177 157 157
  178 59 59
  179 24 24
  180 31 31
  181 12 12
  182 137 137
  183 360 360
  184 121 121
  185 16 16
  187 27 27
  188 8 8
  189 349 349
  190 63 63
  191 114 114
  192 12 12
  193 8 8
  194 24 24
  195 35 35
  196 243 243
  197 47 47
  198 8 8
  199 20 20
  200 8 8
  201 27 27
  202 67 67
  203 176 176
  204 71 71
  205 59 59
  206 12 12
  207 12 12
  208 223 223
  209 999 999
  210 157 157
  211 47 47
  212 8 8
  213 8 8
  214 27 27
  215 43 43
  216 16 16
  217 106 106
  218 20 20
  219 43 43
  220 27 27
  221 47 47
  222 533 533
  223 870 870
  224 161 161
  225 12 12
  226 16 16
  227 8 8
  228 8 8
  229 98 98
  230 106 106
  231 86 86
  232 55 55
  233 82 82
  234 27 27
  235 35 35
  236 47 47
  237 63 63
  238 43 43
  239 12 12
  240 8 8
  241 31 31
  242 39 39
  243 78 78
  244 153 153
  245 78 78
  246 59 59
  247 51 51
  248 20 20
  249 784 784
  250 353 353
  251 63 63
  252 12 12
  253 27 27
  254 16 16
  256 35 35
  257 172 172
  258 266 266
  259 102 102
  260 86 86
  261 27 27
  262 20 20
  263 59 59
  264 24 24
  265 71 71
  266 12 12
  267 20 20
  268 35 35
  269 16 16
  270 78 78
  271 63 63
  272 31 31
  273 98 98
  274 47 47
  275 27 27
  276 55 55
  277 8 8
  279 12 12
  282 8 8
  283 59 59
  284 74 74
  285 153 153
  286 43 43
  287 47 47
  288 8 8
  289 180 180
  290 125 125
  291 764 764
  292 141 141
  293 20 20
  294 8 8
  297 27 27
  298 16 16
  299 24 24
  300 8 8
  301 8 8
  304 8 8
  306 12 12
  307 55 55
  308 20 20
  309 133 133
  310 43 43
  311 67 67
  312 20 20
  313 8 8
  325 51 51
  326 59 59
  327 20 20
  328 24 24