ACCESSION: MSBNK-Waters-WA001127
RECORD_TITLE: Corticosterone; LC-ESI-Q; MS; POS; 15 V, 30 V
DATE: 2016.01.19 (Created 2007.08.01, modified 2011.05.06)
AUTHORS: Nihon Waters K.K.
LICENSE: CC BY-NC

CH$NAME: Corticosterone
CH$COMPOUND_CLASS: N/A
CH$FORMULA: C21H30O4
CH$EXACT_MASS: 346.21441
CH$SMILES: OCC(=O)C(C4)C(C)(C3)C([H])(C4)C([H])(C1)C([H])(C(O)3)C(C)(C2)C(=CC(=O)C2)C1
CH$IUPAC: InChI=1S/C21H30O4/c1-20-8-7-13(23)9-12(20)3-4-14-15-5-6-16(18(25)11-22)21(15,2)10-17(24)19(14)20/h9,14-17,19,22,24H,3-8,10-11H2,1-2H3/t14-,15-,16+,17-,19+,20-,21-/m0/s1
CH$LINK: CAS 50-22-6
CH$LINK: INCHIKEY OMFXVFTZEKFJBZ-HJTSIMOOSA-N
CH$LINK: COMPTOX DTXSID6022474

AC$INSTRUMENT: ZQ, Waters
AC$INSTRUMENT_TYPE: LC-ESI-Q
AC$MASS_SPECTROMETRY: MS_TYPE MS
AC$MASS_SPECTROMETRY: ION_MODE POSITIVE
AC$MASS_SPECTROMETRY: IONIZATION ESI
AC$CHROMATOGRAPHY: RETENTION_TIME 15.200 min
AC$CHROMATOGRAPHY: COLUMN_NAME 2.1 mm id - 3. 5{mu}m XTerra C18MS
AC$CHROMATOGRAPHY: COLUMN_TEMPERATURE 35 C
AC$CHROMATOGRAPHY: SAMPLING_CONE 15 V, 30 V

MS$DATA_PROCESSING: FIND_PEAK ignore rel.int. < 5

PK$SPLASH: splash10-0002-0109000000-ef00a768b22ec6cc7714
PK$NUM_PEAK: 26
PK$PEAK: m/z int. rel.int.
  101 8 8
  105 20 20
  114 8 8
  115 35 35
  128 16 16
  141 12 12
  144 8 8
  145 8 8
  151 24 24
  152 12 12
  172 8 8
  194 8 8
  208 16 16
  251 12 12
  253 8 8
  265 8 8
  279 16 16
  294 8 8
  311 12 12
  329 39 39
  333 8 8
  347 999 999
  348 165 165
  349 24 24
  388 141 141
  389 27 27