ACCESSION: MSBNK-Waters-WA001132
RECORD_TITLE: Clozapine N-oxide; LC-ESI-Q; MS; POS; 30 V
DATE: 2016.01.19 (Created 2007.08.01, modified 2011.05.06)
AUTHORS: Nihon Waters K.K.
LICENSE: CC BY-NC

CH$NAME: Clozapine N-oxide
CH$COMPOUND_CLASS: N/A
CH$FORMULA: C18H19ClN4O
CH$EXACT_MASS: 342.12474
CH$SMILES: Clc(c4)cc(N=1)c(c4)Nc(c3)c(ccc3)C1N(C2)CC[N+1](C)([O-1])C2
CH$IUPAC: InChI=1S/C18H19ClN4O/c1-23(24)10-8-22(9-11-23)18-14-4-2-3-5-15(14)20-16-7-6-13(19)12-17(16)21-18/h2-7,12,20H,8-11H2,1H3
CH$LINK: CAS 34233-69-7
CH$LINK: INCHIKEY OGUCZBIQSYYWEF-UHFFFAOYSA-N

AC$INSTRUMENT: ZQ, Waters
AC$INSTRUMENT_TYPE: LC-ESI-Q
AC$MASS_SPECTROMETRY: MS_TYPE MS
AC$MASS_SPECTROMETRY: ION_MODE POSITIVE
AC$MASS_SPECTROMETRY: IONIZATION ESI
AC$CHROMATOGRAPHY: RETENTION_TIME 13.900 min
AC$CHROMATOGRAPHY: COLUMN_NAME 2.1 mm id - 3. 5{mu}m XTerra C18MS
AC$CHROMATOGRAPHY: COLUMN_TEMPERATURE 35 C
AC$CHROMATOGRAPHY: SAMPLING_CONE 30 V

MS$DATA_PROCESSING: FIND_PEAK ignore rel.int. < 5

PK$SPLASH: splash10-0006-0069000000-34fb757a90d1dfa9062b
PK$NUM_PEAK: 61
PK$PEAK: m/z int. rel.int.
  100 27 27
  101 129 129
  117 20 20
  127 12 12
  179 8 8
  208 16 16
  215 24 24
  217 16 16
  227 8 8
  228 8 8
  239 8 8
  243 239 239
  244 153 153
  245 157 157
  246 59 59
  247 31 31
  255 8 8
  256 137 137
  257 24 24
  258 47 47
  259 12 12
  263 8 8
  265 47 47
  266 8 8
  268 71 71
  269 20 20
  270 35 35
  271 12 12
  272 12 12
  282 12 12
  283 16 16
  284 16 16
  285 8 8
  286 12 12
  287 8 8
  296 12 12
  297 12 12
  299 204 204
  300 43 43
  301 71 71
  302 12 12
  312 24 24
  313 8 8
  314 12 12
  325 110 110
  326 55 55
  327 35 35
  328 24 24
  341 31 31
  342 51 51
  343 999 999
  344 196 196
  345 333 333
  346 43 43
  357 8 8
  359 20 20
  361 12 12
  365 24 24
  367 12 12
  375 12 12
  381 8 8