ACCESSION: MSBNK-Waters-WA001135
RECORD_TITLE: Clozapine; LC-ESI-Q; MS; POS; 75 V
DATE: 2016.01.19 (Created 2007.08.01, modified 2011.05.06)
AUTHORS: Nihon Waters K.K.
LICENSE: CC BY-NC

CH$NAME: Clozapine
CH$COMPOUND_CLASS: N/A
CH$FORMULA: C18H19ClN4
CH$EXACT_MASS: 326.12982
CH$SMILES: CN(C4)CCN(C4)C(=N1)c(c3)c(ccc3)Nc(c2)c(cc(Cl)c2)1
CH$IUPAC: InChI=1S/C18H19ClN4/c1-22-8-10-23(11-9-22)18-14-4-2-3-5-15(14)20-16-7-6-13(19)12-17(16)21-18/h2-7,12,20H,8-11H2,1H3
CH$LINK: CAS 5786-21-0
CH$LINK: INCHIKEY QZUDBNBUXVUHMW-UHFFFAOYSA-N
CH$LINK: COMPTOX DTXSID5022855

AC$INSTRUMENT: ZQ, Waters
AC$INSTRUMENT_TYPE: LC-ESI-Q
AC$MASS_SPECTROMETRY: MS_TYPE MS
AC$MASS_SPECTROMETRY: ION_MODE POSITIVE
AC$MASS_SPECTROMETRY: IONIZATION ESI
AC$CHROMATOGRAPHY: RETENTION_TIME 13.800 min
AC$CHROMATOGRAPHY: COLUMN_NAME 2.1 mm id - 3. 5{mu}m XTerra C18MS
AC$CHROMATOGRAPHY: COLUMN_TEMPERATURE 35 C
AC$CHROMATOGRAPHY: SAMPLING_CONE 75 V

MS$DATA_PROCESSING: FIND_PEAK ignore rel.int. < 5

PK$SPLASH: splash10-006x-0490000000-99fcd3be835468053f72
PK$NUM_PEAK: 88
PK$PEAK: m/z int. rel.int.
  101 16 16
  102 8 8
  113 16 16
  114 8 8
  115 8 8
  117 24 24
  124 12 12
  130 47 47
  131 24 24
  133 141 141
  134 8 8
  141 8 8
  143 8 8
  145 12 12
  153 8 8
  154 8 8
  159 12 12
  166 12 12
  167 8 8
  168 8 8
  175 12 12
  177 63 63
  178 8 8
  181 55 55
  182 8 8
  183 8 8
  191 20 20
  192 999 999
  193 137 137
  194 24 24
  200 16 16
  201 8 8
  202 8 8
  203 20 20
  205 12 12
  206 24 24
  207 67 67
  208 153 153
  209 27 27
  215 20 20
  216 31 31
  217 16 16
  218 27 27
  219 16 16
  220 24 24
  221 24 24
  226 35 35
  227 349 349
  228 82 82
  229 157 157
  230 27 27
  231 16 16
  232 16 16
  233 12 12
  234 24 24
  235 27 27
  239 12 12
  240 16 16
  241 39 39
  242 20 20
  243 168 168
  244 27 27
  245 59 59
  246 20 20
  253 55 55
  254 24 24
  255 51 51
  256 39 39
  257 16 16
  258 16 16
  265 8 8
  266 8 8
  267 8 8
  268 24 24
  270 764 764
  271 110 110
  272 247 247
  273 31 31
  280 8 8
  281 12 12
  282 8 8
  284 12 12
  286 8 8
  296 168 168
  297 27 27
  298 67 67
  299 8 8
  327 8 8