ACCESSION: MSBNK-Waters-WA001193
RECORD_TITLE: Amiloride; LC-ESI-Q; MS; POS; 60 V
DATE: 2016.01.19 (Created 2007.08.01, modified 2011.05.06)
AUTHORS: Nihon Waters K.K.
LICENSE: CC BY-NC

CH$NAME: Amiloride
CH$COMPOUND_CLASS: N/A
CH$FORMULA: C6H8ClN7O
CH$EXACT_MASS: 229.04789
CH$SMILES: NC(=N)NC(=O)c(n1)c(N)nc(N)c(Cl)1
CH$IUPAC: InChI=1S/C6H8ClN7O/c7-2-4(9)13-3(8)1(12-2)5(15)14-6(10)11/h(H4,8,9,13)(H4,10,11,14,15)
CH$LINK: CAS 2609-46-3
CH$LINK: INCHIKEY XSDQTOBWRPYKKA-UHFFFAOYSA-N
CH$LINK: COMPTOX DTXSID9043853

AC$INSTRUMENT: ZQ, Waters
AC$INSTRUMENT_TYPE: LC-ESI-Q
AC$MASS_SPECTROMETRY: MS_TYPE MS
AC$MASS_SPECTROMETRY: ION_MODE POSITIVE
AC$MASS_SPECTROMETRY: IONIZATION ESI
AC$CHROMATOGRAPHY: RETENTION_TIME 5.000 min
AC$CHROMATOGRAPHY: COLUMN_NAME 2.1 mm id - 3. 5{mu}m XTerra C18MS
AC$CHROMATOGRAPHY: COLUMN_TEMPERATURE 35 C
AC$CHROMATOGRAPHY: SAMPLING_CONE 60 V

MS$DATA_PROCESSING: FIND_PEAK ignore rel.int. < 5

PK$SPLASH: splash10-03l9-0910000000-f3d6ac2ef2a6950ad837
PK$NUM_PEAK: 30
PK$PEAK: m/z int. rel.int.
  118 552 552
  119 16 16
  125 55 55
  126 31 31
  143 231 231
  144 16 16
  145 67 67
  157 8 8
  161 862 862
  162 8 8
  163 286 286
  164 8 8
  171 627 627
  172 20 20
  173 204 204
  180 12 12
  184 31 31
  186 12 12
  189 999 999
  190 20 20
  191 337 337
  192 8 8
  198 16 16
  202 12 12
  213 8 8
  230 548 548
  231 16 16
  232 180 180
  234 12 12
  252 8 8