ACCESSION: MSBNK-Waters-WA001229
RECORD_TITLE: Oxprenolol; LC-ESI-Q; MS; POS; 75 V, 90 V
DATE: 2016.01.19 (Created 2007.08.01, modified 2011.05.06)
AUTHORS: Nihon Waters K.K.
LICENSE: CC BY-NC

CH$NAME: Oxprenolol
CH$COMPOUND_CLASS: N/A
CH$FORMULA: C15H23NO3
CH$EXACT_MASS: 265.16779
CH$SMILES: C=CCOc(c1)c(ccc1)OCC(O)CNC(C)C
CH$IUPAC: InChI=1S/C15H23NO3/c1-4-9-18-14-7-5-6-8-15(14)19-11-13(17)10-16-12(2)3/h4-8,12-13,16-17H,1,9-11H2,2-3H3
CH$LINK: CAS 6452-71-7
CH$LINK: INCHIKEY CEMAWMOMDPGJMB-UHFFFAOYSA-N
CH$LINK: COMPTOX DTXSID1043835

AC$INSTRUMENT: ZQ, Waters
AC$INSTRUMENT_TYPE: LC-ESI-Q
AC$MASS_SPECTROMETRY: MS_TYPE MS
AC$MASS_SPECTROMETRY: ION_MODE POSITIVE
AC$MASS_SPECTROMETRY: IONIZATION ESI
AC$CHROMATOGRAPHY: RETENTION_TIME 10.000 min
AC$CHROMATOGRAPHY: COLUMN_NAME 2.1 mm id - 3. 5{mu}m XTerra C18MS
AC$CHROMATOGRAPHY: COLUMN_TEMPERATURE 35 C
AC$CHROMATOGRAPHY: SAMPLING_CONE 75 V, 90 V

MS$DATA_PROCESSING: FIND_PEAK ignore rel.int. < 5

PK$SPLASH: splash10-0avi-0910000000-c92b76a9b4b474ebf7ce
PK$NUM_PEAK: 83
PK$PEAK: m/z int. rel.int.
  100 239 239
  101 16 16
  102 31 31
  103 556 556
  104 12 12
  105 999 999
  106 51 51
  107 466 466
  108 27 27
  109 20 20
  110 419 419
  111 8 8
  113 12 12
  115 262 262
  116 521 521
  117 118 118
  118 337 337
  119 121 121
  121 846 846
  122 255 255
  123 219 219
  124 20 20
  127 27 27
  128 78 78
  129 31 31
  130 67 67
  131 165 165
  132 39 39
  133 309 309
  134 12 12
  135 407 407
  136 43 43
  137 12 12
  138 8 8
  141 12 12
  143 8 8
  144 20 20
  145 74 74
  147 270 270
  148 133 133
  149 78 78
  150 16 16
  151 8 8
  155 12 12
  157 8 8
  158 12 12
  159 47 47
  161 59 59
  162 20 20
  163 20 20
  174 8 8
  175 31 31
  177 90 90
  178 12 12
  184 24 24
  185 8 8
  189 16 16
  200 12 12
  201 8 8
  203 8 8
  206 8 8
  210 39 39
  218 8 8
  221 20 20
  224 16 16
  225 35 35
  227 8 8
  232 8 8
  233 12 12
  234 20 20
  240 8 8
  247 16 16
  248 12 12
  265 8 8
  266 513 513
  267 67 67
  268 8 8
  273 20 20
  274 71 71
  275 16 16
  281 8 8
  288 27 27
  304 20 20