ACCESSION: MSBNK-Waters-WA001251
RECORD_TITLE: Methylphenidate; LC-ESI-Q; MS; POS; 45 V
DATE: 2016.01.19 (Created 2007.08.01, modified 2012.05.21)
AUTHORS: Nihon Waters K.K.
LICENSE: CC BY-NC

CH$NAME: Methylphenidate
CH$COMPOUND_CLASS: N/A
CH$FORMULA: C14H19NO2
CH$EXACT_MASS: 233.14158
CH$SMILES: COC(=O)C(C(C2)NCCC2)c(c1)cccc1
CH$IUPAC: InChI=1S/C14H19NO2/c1-17-14(16)13(11-7-3-2-4-8-11)12-9-5-6-10-15-12/h2-4,7-8,12-13,15H,5-6,9-10H2,1H3
CH$LINK: CAS 113-45-1
CH$LINK: INCHIKEY DUGOZIWVEXMGBE-UHFFFAOYSA-N
CH$LINK: COMPTOX DTXSID5023299

AC$INSTRUMENT: ZQ, Waters
AC$INSTRUMENT_TYPE: LC-ESI-Q
AC$MASS_SPECTROMETRY: MS_TYPE MS
AC$MASS_SPECTROMETRY: ION_MODE POSITIVE
AC$MASS_SPECTROMETRY: IONIZATION ESI
AC$CHROMATOGRAPHY: RETENTION_TIME 11.900 min
AC$CHROMATOGRAPHY: COLUMN_NAME 2.1 mm id - 3. 5{mu}m XTerra C18MS
AC$CHROMATOGRAPHY: COLUMN_TEMPERATURE 35 C
AC$CHROMATOGRAPHY: SAMPLING_CONE 45 V

MS$DATA_PROCESSING: FIND_PEAK ignore rel.int. < 5

PK$SPLASH: splash10-001i-0190000000-a93fcbf0d06a87e45574
PK$NUM_PEAK: 11
PK$PEAK: m/z int. rel.int.
  115 16 16
  125 8 8
  129 31 31
  146 8 8
  157 24 24
  174 137 137
  175 12 12
  202 12 12
  234 999 999
  235 129 129
  236 12 12