ACCESSION: MSBNK-Waters-WA001265
RECORD_TITLE: Loprazolam; LC-ESI-Q; MS; POS; 75 V
DATE: 2016.01.19 (Created 2007.08.01, modified 2011.05.06)
AUTHORS: Nihon Waters K.K.
LICENSE: CC BY-NC

CH$NAME: Loprazolam
CH$COMPOUND_CLASS: N/A
CH$FORMULA: C23H21ClN6O3
CH$EXACT_MASS: 464.13637
CH$SMILES: CN(C5)CCN(C5)C=c(n4)c(=O)n(c24)c(c3)c(cc(N(=O)=O)c3)C(=NC2)c(c1)c(Cl)ccc1
CH$IUPAC: InChI=1S/C23H21ClN6O3/c1-27-8-10-28(11-9-27)14-19-23(31)29-20-7-6-15(30(32)33)12-17(20)22(25-13-21(29)26-19)16-4-2-3-5-18(16)24/h2-7,12,14H,8-11,13H2,1H3/b19-14+
CH$LINK: CAS 61197-73-7
CH$LINK: INCHIKEY UTEFBSAVJNEPTR-XMHGGMMESA-N

AC$INSTRUMENT: ZQ, Waters
AC$INSTRUMENT_TYPE: LC-ESI-Q
AC$MASS_SPECTROMETRY: MS_TYPE MS
AC$MASS_SPECTROMETRY: ION_MODE POSITIVE
AC$MASS_SPECTROMETRY: IONIZATION ESI
AC$CHROMATOGRAPHY: RETENTION_TIME 13.400 min
AC$CHROMATOGRAPHY: COLUMN_NAME 2.1 mm id - 3. 5{mu}m XTerra C18MS
AC$CHROMATOGRAPHY: COLUMN_TEMPERATURE 35 C
AC$CHROMATOGRAPHY: SAMPLING_CONE 75 V

MS$DATA_PROCESSING: FIND_PEAK ignore rel.int. < 5

PK$SPLASH: splash10-03xr-0825900000-34111d4ec99c8a52d26f
PK$NUM_PEAK: 125
PK$PEAK: m/z int. rel.int.
  101 8 8
  107 20 20
  108 31 31
  109 98 98
  111 999 999
  112 153 153
  113 12 12
  121 27 27
  123 67 67
  125 78 78
  127 31 31
  135 20 20
  136 12 12
  138 43 43
  139 8 8
  149 20 20
  151 24 24
  162 8 8
  163 12 12
  164 12 12
  166 102 102
  167 8 8
  190 51 51
  217 12 12
  225 16 16
  233 8 8
  235 8 8
  240 24 24
  242 16 16
  252 110 110
  253 20 20
  254 67 67
  255 12 12
  256 12 12
  263 20 20
  266 8 8
  270 8 8
  271 8 8
  281 8 8
  286 8 8
  288 12 12
  290 8 8
  293 8 8
  298 86 86
  299 20 20
  300 78 78
  301 16 16
  302 20 20
  310 8 8
  315 8 8
  316 78 78
  317 20 20
  318 27 27
  319 12 12
  321 12 12
  323 8 8
  325 8 8
  326 8 8
  327 8 8
  332 8 8
  334 16 16
  335 8 8
  336 8 8
  337 12 12
  339 63 63
  340 16 16
  341 20 20
  343 8 8
  344 20 20
  345 8 8
  346 8 8
  351 43 43
  352 16 16
  353 31 31
  354 8 8
  355 12 12
  362 71 71
  363 20 20
  364 31 31
  365 16 16
  367 82 82
  368 16 16
  369 27 27
  370 8 8
  376 31 31
  377 12 12
  378 24 24
  379 20 20
  380 31 31
  381 43 43
  382 16 16
  383 16 16
  390 35 35
  391 20 20
  392 20 20
  393 12 12
  394 16 16
  395 8 8
  396 12 12
  401 8 8
  408 372 372
  409 67 67
  410 137 137
  411 24 24
  419 20 20
  420 8 8
  422 129 129
  423 24 24
  424 47 47
  425 8 8
  435 8 8
  437 8 8
  447 8 8
  448 8 8
  465 478 478
  466 90 90
  467 184 184
  468 35 35
  487 168 168
  488 31 31
  489 67 67
  490 8 8
  503 39 39
  504 8 8
  505 20 20