ACCESSION: MSBNK-Waters-WA001285
RECORD_TITLE: Fluoxetine; LC-ESI-Q; MS; POS; 15 V
DATE: 2016.01.19 (Created 2007.08.01, modified 2011.05.06)
AUTHORS: Nihon Waters K.K.
LICENSE: CC BY-NC

CH$NAME: Fluoxetine
CH$COMPOUND_CLASS: N/A
CH$FORMULA: C17H18F3NO
CH$EXACT_MASS: 309.13405
CH$SMILES: CNCCC(Oc(c2)ccc(c2)C(F)(F)F)c(c1)cccc1
CH$IUPAC: InChI=1S/C17H18F3NO/c1-21-12-11-16(13-5-3-2-4-6-13)22-15-9-7-14(8-10-15)17(18,19)20/h2-10,16,21H,11-12H2,1H3
CH$LINK: CAS 54910-89-3
CH$LINK: INCHIKEY RTHCYVBBDHJXIQ-UHFFFAOYSA-N
CH$LINK: COMPTOX DTXSID7023067

AC$INSTRUMENT: ZQ, Waters
AC$INSTRUMENT_TYPE: LC-ESI-Q
AC$MASS_SPECTROMETRY: MS_TYPE MS
AC$MASS_SPECTROMETRY: ION_MODE POSITIVE
AC$MASS_SPECTROMETRY: IONIZATION ESI
AC$CHROMATOGRAPHY: RETENTION_TIME 15.100 min
AC$CHROMATOGRAPHY: COLUMN_NAME 2.1 mm id - 3. 5{mu}m XTerra C18MS
AC$CHROMATOGRAPHY: COLUMN_TEMPERATURE 35 C
AC$CHROMATOGRAPHY: SAMPLING_CONE 15 V

MS$DATA_PROCESSING: FIND_PEAK ignore rel.int. < 5

PK$SPLASH: splash10-03di-0309000000-63f4c040be05ae7790ec
PK$NUM_PEAK: 12
PK$PEAK: m/z int. rel.int.
  117 59 59
  148 114 114
  149 8 8
  164 137 137
  165 12 12
  166 51 51
  182 8 8
  189 8 8
  310 999 999
  311 161 161
  312 16 16
  351 8 8