ACCESSION: MSBNK-Waters-WA001316
RECORD_TITLE: Chlorpromazin; LC-ESI-Q; MS; POS; 45 V
DATE: 2016.01.19 (Created 2007.08.01, modified 2011.05.06)
AUTHORS: Nihon Waters K.K.
LICENSE: CC BY-NC

CH$NAME: Chlorpromazin
CH$COMPOUND_CLASS: N/A
CH$FORMULA: C17H19ClN2S
CH$EXACT_MASS: 318.09575
CH$SMILES: CN(C)CCCN(c21)c(c3)c(ccc(Cl)3)Sc(cccc2)1
CH$IUPAC: InChI=1S/C17H19ClN2S/c1-19(2)10-5-11-20-14-6-3-4-7-16(14)21-17-9-8-13(18)12-15(17)20/h3-4,6-9,12H,5,10-11H2,1-2H3
CH$LINK: CAS 50-53-3
CH$LINK: INCHIKEY ZPEIMTDSQAKGNT-UHFFFAOYSA-N
CH$LINK: COMPTOX DTXSID0022808

AC$INSTRUMENT: ZQ, Waters
AC$INSTRUMENT_TYPE: LC-ESI-Q
AC$MASS_SPECTROMETRY: MS_TYPE MS
AC$MASS_SPECTROMETRY: ION_MODE POSITIVE
AC$MASS_SPECTROMETRY: IONIZATION ESI
AC$CHROMATOGRAPHY: RETENTION_TIME 15.200 min
AC$CHROMATOGRAPHY: COLUMN_NAME 2.1 mm id - 3. 5{mu}m XTerra C18MS
AC$CHROMATOGRAPHY: COLUMN_TEMPERATURE 35 C
AC$CHROMATOGRAPHY: SAMPLING_CONE 45 V

MS$DATA_PROCESSING: FIND_PEAK ignore rel.int. < 5

PK$SPLASH: splash10-01b9-0059000000-5de55b8541d95f54de43
PK$NUM_PEAK: 79
PK$PEAK: m/z int. rel.int.
  102 31 31
  133 8 8
  136 12 12
  149 12 12
  150 12 12
  176 16 16
  180 8 8
  196 12 12
  198 8 8
  199 16 16
  200 8 8
  211 8 8
  214 43 43
  215 47 47
  216 24 24
  223 20 20
  228 149 149
  229 16 16
  230 12 12
  232 8 8
  233 20 20
  234 8 8
  235 8 8
  238 8 8
  239 188 188
  240 27 27
  241 20 20
  242 16 16
  244 67 67
  246 208 208
  247 20 20
  248 82 82
  249 8 8
  254 8 8
  255 51 51
  256 188 188
  257 31 31
  258 12 12
  262 12 12
  269 8 8
  272 153 153
  273 24 24
  274 110 110
  275 16 16
  276 39 39
  283 8 8
  285 47 47
  286 20 20
  290 51 51
  291 8 8
  292 20 20
  297 8 8
  301 309 309
  302 63 63
  303 16 16
  304 12 12
  310 20 20
  317 184 184
  319 999 999
  320 157 157
  321 427 427
  322 55 55
  323 12 12
  324 59 59
  325 12 12
  328 16 16
  329 12 12
  333 161 161
  334 16 16
  335 118 118
  336 12 12
  337 35 35
  338 8 8
  342 59 59
  343 12 12
  351 94 94
  352 12 12
  353 35 35
  358 8 8