ACCESSION: MSBNK-Waters-WA001358
RECORD_TITLE: Acefylline; LC-ESI-Q; MS; NEG; 30 V
DATE: 2016.01.19 (Created 2007.08.01, modified 2011.05.06)
AUTHORS: Nihon Waters K.K.
LICENSE: CC BY-NC

CH$NAME: Acefylline
CH$COMPOUND_CLASS: N/A
CH$FORMULA: C9H10N4O4
CH$EXACT_MASS: 238.07020
CH$SMILES: OC(=O)Cn(c2)c(C(=O)1)c(n2)N(C)C(=O)N(C)1
CH$IUPAC: InChI=1S/C9H10N4O4/c1-11-7-6(8(16)12(2)9(11)17)13(4-10-7)3-5(14)15/h4H,3H2,1-2H3,(H,14,15)
CH$LINK: CAS 652-37-9
CH$LINK: INCHIKEY HCYFGRCYSCXKNQ-UHFFFAOYSA-N
CH$LINK: COMPTOX DTXSID6057796

AC$INSTRUMENT: ZQ, Waters
AC$INSTRUMENT_TYPE: LC-ESI-Q
AC$MASS_SPECTROMETRY: MS_TYPE MS
AC$MASS_SPECTROMETRY: ION_MODE NEGATIVE
AC$MASS_SPECTROMETRY: IONIZATION ESI
AC$CHROMATOGRAPHY: RETENTION_TIME 2.600 min
AC$CHROMATOGRAPHY: COLUMN_NAME 2.1 mm id - 3. 5{mu}m XTerra C18MS
AC$CHROMATOGRAPHY: COLUMN_TEMPERATURE 35 C
AC$CHROMATOGRAPHY: SAMPLING_CONE 30 V

MS$DATA_PROCESSING: FIND_PEAK ignore rel.int. < 5

PK$SPLASH: splash10-000l-0950000000-bec7f9fba5e74b1db611
PK$NUM_PEAK: 74
PK$PEAK: m/z int. rel.int.
  101 20 20
  102 94 94
  103 16 16
  106 12 12
  109 67 67
  111 43 43
  113 39 39
  115 102 102
  117 16 16
  119 86 86
  121 12 12
  123 24 24
  124 43 43
  127 94 94
  132 8 8
  135 31 31
  136 999 999
  137 24 24
  138 16 16
  139 59 59
  141 16 16
  142 12 12
  148 27 27
  151 20 20
  156 24 24
  157 12 12
  158 12 12
  159 67 67
  162 12 12
  163 35 35
  167 47 47
  169 39 39
  170 43 43
  171 8 8
  173 47 47
  175 121 121
  177 16 16
  178 39 39
  181 20 20
  183 27 27
  187 8 8
  191 12 12
  193 968 968
  194 27 27
  197 43 43
  199 20 20
  201 12 12
  203 27 27
  204 98 98
  208 16 16
  209 12 12
  210 8 8
  212 47 47
  214 118 118
  216 145 145
  219 27 27
  220 86 86
  222 47 47
  224 35 35
  227 20 20
  228 12 12
  229 24 24
  230 12 12
  232 8 8
  237 881 881
  238 20 20
  239 43 43
  241 35 35
  249 12 12
  250 39 39
  253 20 20
  254 51 51
  256 35 35
  258 74 74