ACCESSION: MSBNK-Waters-WA001450
RECORD_TITLE: Imidapril; LC-ESI-Q; MS; POS; 60 V
DATE: 2016.01.19 (Created 2007.08.01, modified 2011.05.06)
AUTHORS: Nihon Waters K.K.
LICENSE: CC BY-NC

CH$NAME: Imidapril
CH$COMPOUND_CLASS: N/A
CH$FORMULA: C20H27N3O6
CH$EXACT_MASS: 405.18999
CH$SMILES: CCOC(=O)C(CCc(c2)cccc2)NC(C)C(=O)N(C(=O)1)C(C(O)=O)CN(C)1
CH$IUPAC: InChI=1S/C20H27N3O6/c1-4-29-19(27)15(11-10-14-8-6-5-7-9-14)21-13(2)17(24)23-16(18(25)26)12-22(3)20(23)28/h5-9,13,15-16,21H,4,10-12H2,1-3H3,(H,25,26)/t13-,15-,16-/m0/s1
CH$LINK: CAS 89371-37-9
CH$LINK: INCHIKEY KLZWOWYOHUKJIG-BPUTZDHNSA-N
CH$LINK: COMPTOX DTXSID2048242

AC$INSTRUMENT: ZQ, Waters
AC$INSTRUMENT_TYPE: LC-ESI-Q
AC$MASS_SPECTROMETRY: MS_TYPE MS
AC$MASS_SPECTROMETRY: ION_MODE POSITIVE
AC$MASS_SPECTROMETRY: IONIZATION ESI
AC$CHROMATOGRAPHY: RETENTION_TIME 13.340 min
AC$CHROMATOGRAPHY: COLUMN_NAME 2.1 mm id - 3. 5{mu}m XTerra C18MS
AC$CHROMATOGRAPHY: COLUMN_TEMPERATURE 35 C
AC$CHROMATOGRAPHY: SAMPLING_CONE 60 V

MS$DATA_PROCESSING: FIND_PEAK ignore rel.int. < 5

PK$SPLASH: splash10-00ls-0910000000-1dfc483c98b94d8b4ba6
PK$NUM_PEAK: 49
PK$PEAK: m/z int. rel.int.
  100 8 8
  101 16 16
  102 165 165
  105 12 12
  109 8 8
  111 8 8
  113 12 12
  115 8 8
  117 999 999
  118 74 74
  119 12 12
  123 8 8
  130 607 607
  131 31 31
  132 16 16
  134 333 333
  135 24 24
  143 8 8
  145 517 517
  146 20 20
  153 16 16
  155 43 43
  157 12 12
  160 548 548
  161 55 55
  162 8 8
  186 39 39
  188 78 78
  199 329 329
  200 20 20
  201 8 8
  206 82 82
  207 8 8
  234 548 548
  235 74 74
  256 82 82
  257 8 8
  261 31 31
  262 8 8
  332 176 176
  333 27 27
  406 141 141
  407 27 27
  428 114 114
  429 24 24
  444 24 24
  445 8 8
  450 43 43
  451 8 8