ACCESSION: MSBNK-Waters-WA001485
RECORD_TITLE: Beclamide; LC-ESI-Q; MS; POS; 30 V
DATE: 2016.01.19 (Created 2007.08.01, modified 2012.05.21)
AUTHORS: Nihon Waters K.K.
LICENSE: CC BY-NC

CH$NAME: Beclamide
CH$COMPOUND_CLASS: N/A
CH$FORMULA: C10H12ClNO
CH$EXACT_MASS: 197.06074
CH$SMILES: ClCCC(=O)NCc(c1)cccc1
CH$IUPAC: InChI=1S/C10H12ClNO/c11-7-6-10(13)12-8-9-4-2-1-3-5-9/h1-5H,6-8H2,(H,12,13)
CH$LINK: CAS 501-68-8
CH$LINK: INCHIKEY JPYQFYIEOUVJDU-UHFFFAOYSA-N
CH$LINK: COMPTOX DTXSID5057755

AC$INSTRUMENT: ZQ, Waters
AC$INSTRUMENT_TYPE: LC-ESI-Q
AC$MASS_SPECTROMETRY: MS_TYPE MS
AC$MASS_SPECTROMETRY: ION_MODE POSITIVE
AC$MASS_SPECTROMETRY: IONIZATION ESI
AC$CHROMATOGRAPHY: RETENTION_TIME 14.300 min
AC$CHROMATOGRAPHY: COLUMN_NAME 2.1 mm id - 3. 5{mu}m XTerra C18MS
AC$CHROMATOGRAPHY: COLUMN_TEMPERATURE 35 C
AC$CHROMATOGRAPHY: SAMPLING_CONE 30 V

MS$DATA_PROCESSING: FIND_PEAK ignore rel.int. < 5

PK$SPLASH: splash10-0006-9300000000-74816c7ac61f66896d2a
PK$ANNOTATION: m/z type
  220 [M+Na]+
PK$NUM_PEAK: 11
PK$PEAK: m/z int. rel.int.
  91 999 999
  92 74 74
  120 168 168
  121 8 8
  122 55 55
  198 208 208
  199 24 24
  200 67 67
  201 8 8
  220 16 16
  222 8 8