ACCESSION: MSBNK-Waters-WA001509
RECORD_TITLE: Chlordiazepoxide; LC-ESI-Q; MS; POS; 15 V
DATE: 2016.01.19 (Created 2007.08.01, modified 2011.05.06)
AUTHORS: Nihon Waters K.K.
LICENSE: CC BY-NC

CH$NAME: Chlordiazepoxide
CH$COMPOUND_CLASS: N/A
CH$FORMULA: C16H14ClN3O
CH$EXACT_MASS: 299.08254
CH$SMILES: CNC(C2)=Nc(c3)c(cc(Cl)c3)C(=[N+1]([O-1])2)c(c1)cccc1
CH$IUPAC: InChI=1S/C16H14ClN3O/c1-18-15-10-20(21)16(11-5-3-2-4-6-11)13-9-12(17)7-8-14(13)19-15/h2-9H,10H2,1H3,(H,18,19)
CH$LINK: CAS 58-25-3
CH$LINK: INCHIKEY ANTSCNMPPGJYLG-UHFFFAOYSA-N
CH$LINK: COMPTOX DTXSID4046022

AC$INSTRUMENT: ZQ, Waters
AC$INSTRUMENT_TYPE: LC-ESI-Q
AC$MASS_SPECTROMETRY: MS_TYPE MS
AC$MASS_SPECTROMETRY: ION_MODE POSITIVE
AC$MASS_SPECTROMETRY: IONIZATION ESI
AC$CHROMATOGRAPHY: RETENTION_TIME 13.020 min
AC$CHROMATOGRAPHY: COLUMN_NAME 2.1 mm id - 3. 5{mu}m XTerra C18MS
AC$CHROMATOGRAPHY: COLUMN_TEMPERATURE 35 C
AC$CHROMATOGRAPHY: SAMPLING_CONE 15 V

MS$DATA_PROCESSING: FIND_PEAK ignore rel.int. < 5

PK$SPLASH: splash10-0udi-0009000000-8b9dd5be45b1bb4b2324
PK$NUM_PEAK: 13
PK$PEAK: m/z int. rel.int.
  207 8 8
  283 8 8
  284 20 20
  286 8 8
  300 999 999
  301 145 145
  302 353 353
  303 51 51
  599 67 67
  600 12 12
  601 51 51
  602 12 12
  603 8 8