ACCESSION: MSBNK-Waters-WA001512
RECORD_TITLE: Nalorphine; LC-ESI-Q; MS; POS; 60 V
DATE: 2016.01.19 (Created 2007.08.01, modified 2011.05.06)
AUTHORS: Nihon Waters K.K.
LICENSE: CC BY-NC

CH$NAME: Nalorphine
CH$COMPOUND_CLASS: N/A
CH$FORMULA: C19H21NO3
CH$EXACT_MASS: 311.15214
CH$SMILES: C=CCN(C5)C(C3)C([H])(C=4)C(C5)(C(C(O)C4)1)c(c23)c(c(O)cc2)O1
CH$IUPAC: InChI=1S/C19H21NO3/c1-2-8-20-9-7-19-12-4-6-15(22)18(19)23-17-14(21)5-3-11(16(17)19)10-13(12)20/h2-6,12-13,15,18,21-22H,1,7-10H2/t12-,13+,15-,18-,19-/m0/s1
CH$LINK: CAS 62-67-9
CH$LINK: INCHIKEY UIQMVEYFGZJHCZ-SSTWWWIQSA-N
CH$LINK: COMPTOX DTXSID3023348

AC$INSTRUMENT: ZQ, Waters
AC$INSTRUMENT_TYPE: LC-ESI-Q
AC$MASS_SPECTROMETRY: MS_TYPE MS
AC$MASS_SPECTROMETRY: ION_MODE POSITIVE
AC$MASS_SPECTROMETRY: IONIZATION ESI
AC$CHROMATOGRAPHY: RETENTION_TIME 7.000 min
AC$CHROMATOGRAPHY: COLUMN_NAME 2.1 mm id - 3. 5{mu}m XTerra C18MS
AC$CHROMATOGRAPHY: COLUMN_TEMPERATURE 35 C
AC$CHROMATOGRAPHY: SAMPLING_CONE 60 V

MS$DATA_PROCESSING: FIND_PEAK ignore rel.int. < 5

PK$SPLASH: splash10-03di-0459000000-6ca9126447309f0d3293
PK$NUM_PEAK: 59
PK$PEAK: m/z int. rel.int.
  108 8 8
  121 8 8
  123 12 12
  132 12 12
  144 8 8
  145 12 12
  147 24 24
  148 35 35
  150 43 43
  153 8 8
  155 20 20
  157 8 8
  161 8 8
  162 12 12
  164 12 12
  165 20 20
  171 8 8
  173 51 51
  181 27 27
  183 47 47
  185 51 51
  186 8 8
  187 12 12
  188 8 8
  191 16 16
  193 31 31
  197 8 8
  198 8 8
  199 24 24
  201 168 168
  202 16 16
  203 8 8
  207 8 8
  209 47 47
  210 8 8
  211 71 71
  212 8 8
  213 8 8
  216 8 8
  219 16 16
  221 20 20
  225 8 8
  226 8 8
  227 51 51
  228 8 8
  229 82 82
  230 8 8
  237 16 16
  239 12 12
  243 8 8
  252 20 20
  253 12 12
  270 98 98
  271 27 27
  294 20 20
  312 999 999
  313 172 172
  314 16 16
  330 16 16