ACCESSION: MSBNK-Waters-WA001528
RECORD_TITLE: Tiaprofenic acid; LC-ESI-Q; MS; POS; 15 V, 30 V
DATE: 2016.01.19 (Created 2007.08.01, modified 2011.05.06)
AUTHORS: Nihon Waters K.K.
LICENSE: CC BY-NC

CH$NAME: Tiaprofenic acid
CH$COMPOUND_CLASS: N/A
CH$FORMULA: C14H12O3S
CH$EXACT_MASS: 260.05071
CH$SMILES: OC(=O)C(C)c(c2)sc(c2)C(=O)c(c1)cccc1
CH$IUPAC: InChI=1S/C14H12O3S/c1-9(14(16)17)11-7-8-12(18-11)13(15)10-5-3-2-4-6-10/h2-9H,1H3,(H,16,17)
CH$LINK: CAS 33005-95-7
CH$LINK: INCHIKEY GUHPRPJDBZHYCJ-UHFFFAOYSA-N
CH$LINK: COMPTOX DTXSID5023665

AC$INSTRUMENT: ZQ, Waters
AC$INSTRUMENT_TYPE: LC-ESI-Q
AC$MASS_SPECTROMETRY: MS_TYPE MS
AC$MASS_SPECTROMETRY: ION_MODE POSITIVE
AC$MASS_SPECTROMETRY: IONIZATION ESI
AC$CHROMATOGRAPHY: RETENTION_TIME 16.250 min
AC$CHROMATOGRAPHY: COLUMN_NAME 2.1 mm id - 3. 5{mu}m XTerra C18MS
AC$CHROMATOGRAPHY: COLUMN_TEMPERATURE 35 C
AC$CHROMATOGRAPHY: SAMPLING_CONE 15 V, 30 V

MS$DATA_PROCESSING: FIND_PEAK ignore rel.int. < 5

PK$SPLASH: splash10-03di-0090210000-e15423f225a5124efac3
PK$NUM_PEAK: 27
PK$PEAK: m/z int. rel.int.
  217 63 63
  218 8 8
  261 999 999
  262 137 137
  263 59 59
  278 274 274
  279 39 39
  280 16 16
  283 8 8
  431 20 20
  447 8 8
  448 8 8
  463 184 184
  464 51 51
  465 24 24
  477 20 20
  480 24 24
  481 8 8
  485 16 16
  521 74 74
  522 20 20
  523 12 12
  538 133 133
  539 31 31
  540 31 31
  541 8 8
  543 8 8