ACCESSION: MSBNK-Waters-WA001531
RECORD_TITLE: Glipizide; LC-ESI-Q; MS; POS; 75 V
DATE: 2016.01.19 (Created 2007.08.01, modified 2011.05.06)
AUTHORS: Nihon Waters K.K.
LICENSE: CC BY-NC

CH$NAME: Glipizide
CH$COMPOUND_CLASS: N/A
CH$FORMULA: C21H27N5O4S
CH$EXACT_MASS: 445.17838
CH$SMILES: Cc(c3)ncc(n3)C(=O)NCCc(c2)ccc(c2)S(=O)(=O)NC(=O)NC(C1)CCCC1
CH$IUPAC: InChI=1S/C21H27N5O4S/c1-15-13-24-19(14-23-15)20(27)22-12-11-16-7-9-18(10-8-16)31(29,30)26-21(28)25-17-5-3-2-4-6-17/h7-10,13-14,17H,2-6,11-12H2,1H3,(H,22,27)(H2,25,26,28)
CH$LINK: CAS 29094-61-9
CH$LINK: INCHIKEY ZJJXGWJIGJFDTL-UHFFFAOYSA-N
CH$LINK: COMPTOX DTXSID0040676

AC$INSTRUMENT: ZQ, Waters
AC$INSTRUMENT_TYPE: LC-ESI-Q
AC$MASS_SPECTROMETRY: MS_TYPE MS
AC$MASS_SPECTROMETRY: ION_MODE POSITIVE
AC$MASS_SPECTROMETRY: IONIZATION ESI
AC$CHROMATOGRAPHY: RETENTION_TIME 15.820 min
AC$CHROMATOGRAPHY: COLUMN_NAME 2.1 mm id - 3. 5{mu}m XTerra C18MS
AC$CHROMATOGRAPHY: COLUMN_TEMPERATURE 35 C
AC$CHROMATOGRAPHY: SAMPLING_CONE 75 V

MS$DATA_PROCESSING: FIND_PEAK ignore rel.int. < 5

PK$SPLASH: splash10-0udi-0911000000-7eec289a8958b3bf52f1
PK$NUM_PEAK: 102
PK$PEAK: m/z int. rel.int.
  100 51 51
  102 8 8
  103 999 999
  104 114 114
  105 20 20
  107 110 110
  108 8 8
  109 20 20
  111 172 172
  112 8 8
  118 31 31
  119 129 129
  120 192 192
  121 380 380
  122 43 43
  123 27 27
  124 8 8
  131 317 317
  132 31 31
  134 63 63
  135 12 12
  136 12 12
  138 8 8
  139 94 94
  144 67 67
  145 8 8
  148 63 63
  149 31 31
  150 278 278
  151 35 35
  153 8 8
  155 12 12
  163 8 8
  166 35 35
  167 415 415
  168 31 31
  169 24 24
  170 8 8
  173 16 16
  175 16 16
  177 8 8
  180 8 8
  183 71 71
  184 43 43
  185 8 8
  191 8 8
  195 20 20
  197 8 8
  198 8 8
  201 8 8
  203 31 31
  207 12 12
  210 20 20
  211 55 55
  212 8 8
  220 16 16
  221 8 8
  222 106 106
  223 24 24
  238 39 39
  240 67 67
  241 12 12
  246 20 20
  255 8 8
  256 47 47
  258 31 31
  286 239 239
  287 39 39
  288 16 16
  304 74 74
  305 12 12
  319 8 8
  321 106 106
  322 24 24
  323 8 8
  327 8 8
  343 31 31
  345 12 12
  347 24 24
  348 8 8
  349 8 8
  353 12 12
  369 110 110
  370 20 20
  371 8 8
  385 35 35
  387 8 8
  401 8 8
  427 8 8
  429 8 8
  444 24 24
  445 8 8
  446 31 31
  447 8 8
  452 12 12
  468 106 106
  469 24 24
  470 8 8
  484 78 78
  485 16 16
  486 12 12
  500 8 8