ACCESSION: MSBNK-Waters-WA001651
RECORD_TITLE: Enoxolone; LC-ESI-Q; MS; POS; 90 V
DATE: 2016.01.19 (Created 2007.08.01, modified 2011.05.06)
AUTHORS: Nihon Waters K.K.
LICENSE: CC BY-NC

CH$NAME: Enoxolone
CH$COMPOUND_CLASS: N/A
CH$FORMULA: C30H46O4
CH$EXACT_MASS: 470.33961
CH$SMILES: C(C1(C)C(O)=O)C(C=52)([H])C(CCC2(C(C3([H])C(=O)C5)(C)CCC(C(C)(C)4)([H])C(C)3CCC(O)4)C)(C)CC1
CH$IUPAC: InChI=1S/C30H46O4/c1-25(2)21-8-11-30(7)23(28(21,5)10-9-22(25)32)20(31)16-18-19-17-27(4,24(33)34)13-12-26(19,3)14-15-29(18,30)6/h16,19,21-23,32H,8-15,17H2,1-7H3,(H,33,34)/t19-,21-,22-,23+,26+,27-,28-,29+,30+/m0/s1
CH$LINK: CAS 471-53-4
CH$LINK: INCHIKEY MPDGHEJMBKOTSU-YKLVYJNSSA-N
CH$LINK: COMPTOX DTXSID9020669

AC$INSTRUMENT: ZQ, Waters
AC$INSTRUMENT_TYPE: LC-ESI-Q
AC$MASS_SPECTROMETRY: MS_TYPE MS
AC$MASS_SPECTROMETRY: ION_MODE POSITIVE
AC$MASS_SPECTROMETRY: IONIZATION ESI
AC$CHROMATOGRAPHY: RETENTION_TIME 20.970 min
AC$CHROMATOGRAPHY: COLUMN_NAME 2.1 mm id - 3. 5{mu}m XTerra C18MS
AC$CHROMATOGRAPHY: COLUMN_TEMPERATURE 35 C
AC$CHROMATOGRAPHY: SAMPLING_CONE 90 V

MS$DATA_PROCESSING: FIND_PEAK ignore rel.int. < 5

PK$SPLASH: splash10-05g0-0910100000-38fd9bc0bf2fa9f4e86e
PK$NUM_PEAK: 157
PK$PEAK: m/z int. rel.int.
  105 145 145
  107 658 658
  108 24 24
  109 470 470
  110 35 35
  111 47 47
  113 153 153
  115 47 47
  119 435 435
  120 31 31
  121 588 588
  122 78 78
  123 255 255
  124 20 20
  125 31 31
  131 20 20
  133 262 262
  135 662 662
  136 63 63
  137 94 94
  139 110 110
  143 31 31
  145 98 98
  146 20 20
  147 219 219
  149 615 615
  150 55 55
  151 55 55
  152 16 16
  153 43 43
  155 12 12
  157 74 74
  159 125 125
  160 24 24
  161 227 227
  163 192 192
  164 12 12
  165 47 47
  171 71 71
  173 157 157
  174 27 27
  175 333 333
  176 47 47
  177 118 118
  178 12 12
  179 47 47
  181 12 12
  182 12 12
  185 20 20
  186 16 16
  187 90 90
  188 12 12
  189 415 415
  190 51 51
  191 74 74
  192 20 20
  193 16 16
  194 12 12
  197 24 24
  199 114 114
  200 20 20
  201 47 47
  203 24 24
  205 16 16
  206 8 8
  207 39 39
  208 8 8
  211 39 39
  213 31 31
  215 102 102
  216 16 16
  217 133 133
  218 31 31
  219 27 27
  221 27 27
  222 12 12
  225 8 8
  229 24 24
  230 20 20
  231 31 31
  232 8 8
  233 20 20
  235 208 208
  236 31 31
  239 12 12
  241 20 20
  243 24 24
  245 67 67
  249 8 8
  253 43 43
  254 8 8
  255 12 12
  256 8 8
  257 12 12
  258 8 8
  259 8 8
  260 8 8
  261 39 39
  262 8 8
  263 67 67
  267 47 47
  269 12 12
  271 90 90
  272 20 20
  273 20 20
  275 27 27
  277 12 12
  278 8 8
  281 12 12
  285 24 24
  289 20 20
  291 24 24
  299 20 20
  303 16 16
  313 8 8
  314 8 8
  315 8 8
  317 161 161
  318 27 27
  323 8 8
  326 12 12
  327 12 12
  329 12 12
  331 8 8
  333 8 8
  340 8 8
  357 8 8
  369 8 8
  383 12 12
  389 12 12
  397 8 8
  407 51 51
  408 16 16
  425 39 39
  426 16 16
  435 24 24
  453 20 20
  455 8 8
  471 999 999
  472 337 337
  473 55 55
  474 8 8
  480 8 8
  493 24 24
  509 306 306
  510 98 98
  511 31 31
  512 31 31
  534 63 63
  535 12 12
  547 67 67
  548 24 24
  549 12 12
  550 63 63
  551 20 20
  553 12 12
  575 8 8