ACCESSION: MSBNK-Waters-WA001656
RECORD_TITLE: Dyphylline; LC-ESI-Q; MS; POS; 75 V, 90 V
DATE: 2016.01.19 (Created 2007.08.01, modified 2011.05.06)
AUTHORS: Nihon Waters K.K.
LICENSE: CC BY-NC

CH$NAME: Diprophylline
CH$NAME: Dyphylline
CH$COMPOUND_CLASS: N/A
CH$FORMULA: C10H14N4O4
CH$EXACT_MASS: 254.10150
CH$SMILES: OCC(O)Cn(c2)c(C(=O)1)c(n2)N(C)C(=O)N(C)1
CH$IUPAC: InChI=1S/C10H14N4O4/c1-12-8-7(9(17)13(2)10(12)18)14(5-11-8)3-6(16)4-15/h5-6,15-16H,3-4H2,1-2H3
CH$LINK: CAS 479-18-5
CH$LINK: INCHIKEY KSCFJBIXMNOVSH-UHFFFAOYSA-N
CH$LINK: COMPTOX DTXSID6022975

AC$INSTRUMENT: ZQ, Waters
AC$INSTRUMENT_TYPE: LC-ESI-Q
AC$MASS_SPECTROMETRY: MS_TYPE MS
AC$MASS_SPECTROMETRY: ION_MODE POSITIVE
AC$MASS_SPECTROMETRY: IONIZATION ESI
AC$CHROMATOGRAPHY: RETENTION_TIME 9.740 min
AC$CHROMATOGRAPHY: COLUMN_NAME 2.1 mm id - 3. 5{mu}m XTerra C18MS
AC$CHROMATOGRAPHY: COLUMN_TEMPERATURE 35 C
AC$CHROMATOGRAPHY: SAMPLING_CONE 75 V, 90 V

MS$DATA_PROCESSING: FIND_PEAK ignore rel.int. < 5

PK$SPLASH: splash10-00di-0900000000-b10d7a56b93b3e361f8f
PK$NUM_PEAK: 30
PK$PEAK: m/z int. rel.int.
  101 8 8
  105 16 16
  108 27 27
  109 20 20
  110 27 27
  116 8 8
  119 12 12
  120 20 20
  122 31 31
  124 999 999
  125 55 55
  130 8 8
  134 8 8
  137 24 24
  140 8 8
  142 16 16
  143 8 8
  144 8 8
  145 8 8
  149 12 12
  181 251 251
  182 24 24
  219 8 8
  255 8 8
  261 8 8
  262 8 8
  263 8 8
  277 35 35
  278 8 8
  293 24 24