ACCESSION: MSBNK-Waters-WA001666
RECORD_TITLE: 8-Chlorotheophylline; LC-ESI-Q; MS; POS; 75 V, 90 V
DATE: 2016.01.19 (Created 2007.08.01, modified 2011.05.06)
AUTHORS: Nihon Waters K.K.
LICENSE: CC BY-NC

CH$NAME: 8-Chlorotheophylline
CH$COMPOUND_CLASS: N/A
CH$FORMULA: C7H7ClN4O2
CH$EXACT_MASS: 214.02575
CH$SMILES: CN1C2=C(C(=O)N(C1=O)C)NC(=N2)Cl
CH$IUPAC: InChI=1S/C7H7ClN4O2/c1-11-4-3(9-6(8)10-4)5(13)12(2)7(11)14/h1-2H3,(H,9,10)
CH$LINK: CAS 85-18-7
CH$LINK: INCHIKEY RYIGNEOBDRVTHA-UHFFFAOYSA-N
CH$LINK: COMPTOX DTXSID5043764

AC$INSTRUMENT: ZQ, Waters
AC$INSTRUMENT_TYPE: LC-ESI-Q
AC$MASS_SPECTROMETRY: MS_TYPE MS
AC$MASS_SPECTROMETRY: ION_MODE POSITIVE
AC$MASS_SPECTROMETRY: IONIZATION ESI
AC$CHROMATOGRAPHY: RETENTION_TIME 11.030 min
AC$CHROMATOGRAPHY: COLUMN_NAME 2.1 mm id - 3. 5{mu}m XTerra C18MS
AC$CHROMATOGRAPHY: COLUMN_TEMPERATURE 35 C
AC$CHROMATOGRAPHY: SAMPLING_CONE 75 V, 90 V

MS$DATA_PROCESSING: FIND_PEAK ignore rel.int. < 5

PK$SPLASH: splash10-05ai-0900000000-9b4dab3d7d19f04a52f3
PK$NUM_PEAK: 70
PK$PEAK: m/z int. rel.int.
  101 27 27
  102 145 145
  103 380 380
  104 39 39
  105 94 94
  107 31 31
  108 78 78
  109 98 98
  112 16 16
  115 35 35
  116 16 16
  117 24 24
  119 16 16
  120 39 39
  121 67 67
  122 772 772
  123 43 43
  124 8 8
  125 8 8
  126 8 8
  128 157 157
  129 47 47
  130 799 799
  131 110 110
  132 321 321
  133 35 35
  134 8 8
  135 90 90
  136 20 20
  139 16 16
  140 24 24
  142 31 31
  144 31 31
  147 24 24
  148 31 31
  149 8 8
  152 16 16
  155 114 114
  156 63 63
  158 999 999
  159 74 74
  160 376 376
  161 31 31
  163 12 12
  168 35 35
  169 24 24
  170 12 12
  171 71 71
  172 12 12
  175 8 8
  176 71 71
  177 16 16
  178 39 39
  179 12 12
  180 35 35
  182 27 27
  184 12 12
  185 12 12
  186 8 8
  187 16 16
  206 8 8
  210 16 16
  214 8 8
  215 141 141
  217 43 43
  218 8 8
  221 16 16
  223 24 24
  225 24 24
  232 20 20